Packages
Get Gentoo!
gentoo.org sites
gentoo.org
Wiki
Bugs
Forums
Packages
Planet
Archives
Sources
Infra Status
Home
Packages
Maintainers
USE flags
Architectures
About
Gentoo Project
Base System
Packages
464
Stabilization
0
Outdated
56
Pull requests
45
Bugs
1041
Security
122
Changelog
Bug Reports
dev-build/libtool causes failure (infinite loop on Waiting for lock to be removed)
40992 - Assigned to Gentoo's Team for Core System packages
sys-process/cronbase: /etc/crontab deletion of lastrun files causes run-crons to execute more often than it should
69777 - Assigned to Gentoo's Team for Core System packages
dev-build/libtool stores gcc-path internally. sometimes a bad thing due to gcc update
88596 - Assigned to Gentoo's Team for Core System packages
sys-process/procps: support setting sysfs values automatically at boot time using an initscript
94909 - Assigned to Gentoo's Team for Core System packages
app-admin/sudo: SUDO_PS1 should not be respected by default
96598 - Assigned to Gentoo's Team for Core System packages
sys-apps/kbd - Wrong Turkish F Keyboard Layout
119627 - Assigned to Gentoo's Team for Core System packages
sys-apps/coreutils: /bin/hostname should be installed from coreutils not sys-apps/net-tools
128538 - Assigned to Gentoo's Team for Core System packages
app-shells/bash: interactive bashdb triggered by scripts w/out shebang and w/out --debugger due to `shopt -s extdebug` (openssl/rsstool)
141906 - Assigned to Gentoo's Team for Core System packages
app-admin/sysklogd: run without root privileges by default
150845 - Assigned to Gentoo's Team for Core System packages
sys-libs/cracklib: support ${ROOT}/usr/lib/cracklib_dict*
167248 - Assigned to Gentoo's Team for Core System packages
app-shells/bash: readline file completion does not work with multiple lines
173577 - Assigned to Gentoo's Team for Core System packages
sys-libs/db-4.3.29-r2+ubclic compile-fail - undeclared 'TIOCNOTTY' in generated file
174393 - Assigned to Gentoo's Team for Core System packages
sys-fs/e2fsprogs w/ USE=static only produces static e2fsck
178718 - Assigned to Gentoo's Team for Core System packages
sys-apps/coreutils-7.1 with USE=acl and ext3 mounted with -o acl: cp -pr does not reset the setgid bit when appropriate
182136 - Assigned to Gentoo's Team for Core System packages
sys-libs/ncurses: improve ada support
184700 - Assigned to Gentoo's Team for Core System packages
sys-fs/cryptsetup - Ability to find the key device [PATCH] in dm-crypt-start.sh
189901 - Assigned to Gentoo's Team for Core System packages
app-admin/sysklogd log rotating cron script with no perl/debianutils dependency
208560 - Assigned to Gentoo's Team for Core System packages
net-misc/dhcp - pkg_config() doesn't seed chroot with library dependencies
209901 - Assigned to Gentoo's Team for Core System packages
=sys-apps/syscriptor-1.5.15 needs /proc/pci
215196 - Assigned to Gentoo's Team for Core System packages
sys-apps/readahead-list init script file need update for openrc
218024 - Assigned to Robin Johnson
sys-libs/gpm-1.20.3 doesn't accept connections to /dev/gpmctl while X session active
219577 - Assigned to Gentoo's Team for Core System packages
sys-apps/sysvinit is missing hvc console support on xen system with USE=-ibm
242466 - Assigned to Gentoo's Team for Core System packages
sys-fs/cryptsetup - parallel startup warnings interfere with dmcrypt password entry
247767 - Assigned to Gentoo's Team for Core System packages
sys-fs/static-dev abusing ${ROOT}
258121 - Assigned to Gentoo's Team for Core System packages
net-misc/netkit-fingerd: finger man-page typo may cause newbies to set home directory world-writable
260108 - Assigned to Gentoo's Team for Core System packages
sys-apps/coreutils: "/usr/bin/who -b" broken -- probably by sys-apps/openrc
265528 - Assigned to Gentoo's Team for Core System packages
sys-apps/sed-4.2 - tests utf8-[1-4] fail ("XPASS")
275986 - Assigned to Gentoo's Team for Core System packages
app-admin/superadduser-1.0.9 does not make the account when you press enter then starts a new user called -d
277880 - Assigned to Gentoo's Team for Core System packages
sys-libs/gdbm "Block size error" with specific xfs mount option largeio and swidth
278599 - Assigned to Gentoo's Team for Core System packages
app-admin/sysklogd-1.5 takes over existing build logfiles on restart.
282450 - Assigned to Gentoo's Team for Core System packages
net-misc/openssh-5.2_p1-r3 fails interop-tests
288287 - Assigned to Gentoo's Team for Core System packages
dev-build/libtool requires /usr/lib*/libltdl.la
293921 - Assigned to Gentoo's Team for Core System packages
=sys-libs/db-4.8.24 cross compile fail at MIPS platform
297396 - Assigned to Gentoo's Team for Core System packages
sys-apps/util-linux: fsck fails with reiserfs external journal (fsck.reiserfs needs the --journal option)
301541 - Assigned to Gentoo's Team for Core System packages
sys-fs/cryptsetup-1.0.6-r2 (also 1.1.0) fails to create encrypted device when ESSIV is requested
309221 - Assigned to Gentoo's Team for Core System packages
sys-apps/ifplugd apparently starting only on eth0 interface when eth0 and wlan0 are both present
317801 - Assigned to Gentoo's Team for Core System packages
sys-apps/util-linux or sys-fs/e2fsprogs - `fsck -A' should respect loop offset option
321423 - Assigned to Gentoo's Team for Core System packages
sys-block/mbuffer-20090113 potential race condition
322265 - Assigned to Gentoo's Team for Core System packages
net-misc/dhcp: rfc3442 (classless static routes) not supported
342953 - Assigned to Gentoo's Team for Core System packages
sys-block/gpart-0.1h-r2 can't handle disks larger than 2GiB
343859 - Assigned to Gentoo's Team for Core System packages
sys-block/gpart-0.1h-r2 doesn't read partition tables properly on amd64
343877 - Assigned to Gentoo's Team for Core System packages
net-misc/openssh-5.6_p1-r2[X509] fails tests
347876 - Assigned to Patrick McLean
sys-apps/coreutils-8.8 getenforce command not found during src_test
349461 - Assigned to Gentoo's Team for Core System packages
net-dialup/ppp: race between ppp and dhcpcd setting resolver
353045 - Assigned to Gentoo's Team for Core System packages
sys-apps/util-linux-2.19: remount nfs root fs read/write does not work
355329 - Assigned to Gentoo's Team for Core System packages
sys-fs/cryptsetup init-script should support "keyscript"
357227 - Assigned to Gentoo's Team for Core System packages
sys-apps/kbd with sys-apps/openrc - windowkeys="NO" in /etc/conf.d/keymaps does not work reliably
357869 - Assigned to Gentoo's Team for Core System packages
sys-fs/quotatool-1.4.6: quotatool doesnt skip "rootfs / rootfs" mount entry
367331 - Assigned to Gentoo's Team for Core System packages
sys-process/lsof complains about accessing a path not under the specified +D path
372267 - Assigned to Gentoo's Team for Core System packages
app-portage/elt-patches: elibtoolize() should patch libtool-1.? which drops CFLAGS during --mode=link
374771 - Assigned to Gentoo's Team for Core System packages
sys-libs/db: builds static libraries without USE=static-libs
378289 - Assigned to Gentoo's Team for Core System packages
sys-apps/util-linux-2.20-r1: odd agetty (?) behavior change
396233 - Assigned to Gentoo's Team for Core System packages
app-admin/sysklogd-1.5-r2: syslogd: /var/log/news/news.crit: No such file or directory
401501 - Assigned to Gentoo's Team for Core System packages
net-misc/whois doesn't honor LINGUAS for locale files
402293 - Assigned to Gentoo's Team for Core System packages
sys-fs/mdadm-3.1.4: silent failure with large volumes and metadata 0.90
406759 - Assigned to Gentoo's Team for Core System packages
sys-block/nbd: add initscript for nbd-server
408409 - Assigned to Gentoo's Team for Core System packages
app-shells/bash partly ignores *FLAGS, fails to cross-compile because of this
408519 - Assigned to Gentoo's Team for Core System packages
sys-apps/util-linux: fsck -a should skip fs mounted rw already
415249 - Assigned to Gentoo's Team for Core System packages
dev-build/autoconf-2.69 fails test Go
415799 - Assigned to Gentoo's Team for Core System packages
sys-apps/shadow-4.1.5 dev-db/postgresql-server cannot start via initscript "su: Cannot drop the controlling terminal"
416783 - Assigned to Gentoo's Team for Core System packages
net-firewall/ebtables should check for kernel configuration
420435 - Assigned to Gentoo's Team for Core System packages
sys-block/open-iscsi does not work on 32bit userland and 64bit kernel
423591 - Assigned to Gentoo's Team for Core System packages
sys-apps/pciutils - lib/configure: Looking for access methods... Unfortunately, your OS is not supported by the PCI Library
425022 - Assigned to Gentoo's Team for Core System packages
sys-apps/fbset may provide /etc/fb.modes
427092 - Assigned to Gentoo's Team for Core System packages
net-misc/rsync - add --copy-devices support
429462 - Assigned to Gentoo's Team for Core System packages
sys-fs/cryptsetup: Migrate from /etc/conf.d/dmcrypt to /etc/crypttab
429966 - Assigned to Gentoo's Team for Core System packages
net-fs/nfs-utils unable to run nfs client only (nfs4), without server support in kernel
431252 - Assigned to Gentoo's Team for Core System packages
sys-block/open-iscsi - init script has problems with automatic mounting of iSCSI
432454 - Assigned to Gentoo's Team for Core System packages
net-misc/dhcp - dhclient (ipv6) not enabled for ppp devices
432652 - Assigned to Gentoo's Team for Core System packages
app-shells/bash: tests: QA Notice: command not found
434624 - Assigned to Gentoo's Team for Core System packages
net-misc/dhcp does not work on virtual machines that use virtio
437114 - Assigned to Gentoo's Team for Core System packages
sys-fs/quota - quotacheck: Cannot stat() mounted device /dev/root: No such file or directory
438028 - Assigned to Gentoo's Team for Core System packages
sys-boot/grub: does not boot when built with gold linker
439082 - Assigned to Gentoo's Team for Core System packages
sys-apps/coreutils: tests set low VM limit (ulimit) which crashes due to higher memory usage w/sandbox active
439574 - Assigned to Gentoo's Team for Core System packages
app-admin/sudo-1.8.5_p2: some elog messages should only be shown for the first install.
440476 - Assigned to Gentoo's Team for Core System packages
net-misc/dhcp: Fedora patches should be considered for inclusion
441970 - Assigned to Gentoo's Team for Core System packages
sys-fs/cryptsetup - dmcrypt init script should use keymaps
446018 - Assigned to Gentoo's Team for Core System packages
sys-apps/hdparm: add support for disk id in /etc/init.d/hdparm
448334 - Assigned to Gentoo's Team for Core System packages
net-misc/openssh-6.1_p1-r1: ssh login with key hangs
454248 - Assigned to Gentoo's Team for Core System packages
sys-fs/cryptsetup-1.6.0 fails tests (tcrypt-images/tc_2-rmd160-lrw-aesUUID)
454942 - Assigned to Gentoo's Team for Core System packages
sys-process/psmisc: fuser hangs if processes have files open on dead remotes
455458 - Assigned to Gentoo's Team for Core System packages
sys-block/gpart - HOMEPAGE / SRC_URI 404
459270 - Assigned to Gentoo's Team for Core System packages
sys-process/procps: vmstat test fails with hardened/grsec & FEATURES="userpriv"
461500 - Assigned to Gentoo's Team for Core System packages
sys-apps/kexec-tools: purgatory/purgatory.c:1:0: error: code model ‘large’ not supported in x32 mode
467118 - Assigned to Yuan Liao (Leo3418)
net-misc/openssh tests fails due to hardcoded port numbers
471136 - Assigned to Gentoo's Team for Core System packages
=sys-process/time-1.7-r1 - .texi warnings : time.texi:153: warning: node `Resource Measurement' is prev for `Setting Format' in menu but not in sectioning
472368 - Assigned to Gentoo's Team for Core System packages
net-firewall/iptables: x32/n32 ABIs: iptables -L: can't initialize iptables table `filter': Invalid argument
472388 - Assigned to Gentoo's Team for Core System packages
sys-boot/syslinux - Display elog messages when an existing installation was updated
474726 - Assigned to Gentoo's Team for Core System packages
sys-apps/hdparm: add udev rule for configuring devices on the fly
476044 - Assigned to Gentoo's Team for Core System packages
sys-fs/dd-rescue - help the user to decide between ddrescue and dd_rescue
479606 - Assigned to Gentoo's Team for Core System packages
net-fs/nfs4-acl-tools merge upstream bugfixes since 0.3.3 release
480014 - Assigned to Gentoo's Team for Core System packages
net-misc/dhcp-4.2.5_p1 - dhclient does not receive IPv6 DNS servers - dhclient: message status code NoAddrsAvail.
480640 - Assigned to Gentoo's Team for Core System packages
sys-block/open-iscsi: Split init scripts into iscsid and iscsiadm
487694 - Assigned to Gentoo's Team for Core System packages
media-libs/libpng: libpng-config --L_opts repeats default -L/usr/lib64
487740 - Assigned to Gentoo's Team for Core System packages
sys-fs/lvm2 - 'The link /dev/syssdd2/thin_pool should have been created by udev but it was not found. Falling back to direct link creation.' when booting a thin provisioned root file system
490834 - Assigned to Gentoo's Team for Core System packages
sys-apps/fakeroot: when using FEATURES=fakeroot, build sleeps for ever in src_install()
492724 - Assigned to Gentoo's Team for Core System packages
sys-fs/cryptsetup: add support for detached LUKS header
493690 - Assigned to Gentoo's Team for Core System packages
net-firewall/iptables: move from / to /usr
498878 - Assigned to Gentoo's Team for Core System packages
sys-libs/libieee1284 parallel build fails
500752 - Assigned to Gentoo's Team for Core System packages
sys-apps/util-linux-2.24.1: misbehavior when listing mount points in /etc/fstab that involve symlinks
501322 - Assigned to Gentoo's Team for Core System packages
sys-apps/qingy installs .so to /usr/lib instead of /lib
501680 - Assigned to Gentoo's Team for Core System packages
net-misc/openssh - sshd.socket won't trigger ssh host key generation
501708 - Assigned to Gentoo systemd Team
sys-fs/lvm2-2.02.103[clvm,cman] auto_activation_volume_list not respected, no stop_volumes
504092 - Assigned to Gentoo's Team for Core System packages
net-misc/jwhois should use/depend on virtual/libiconv
504844 - Assigned to Gentoo's Team for Core System packages
app-misc/ca-certificates: allow user customization /etc/ca-certificates.conf
504892 - Assigned to Gentoo's Team for Core System packages
sys-apps/mlocate: index additional btrfs subvolumes
505220 - Assigned to Gentoo's Team for Core System packages
sys-apps/sed-4.2.2: cross-compiling for mingw32 fails
507392 - Assigned to Gentoo's Team for Core System packages
net-misc/openssh - ssh fails to connect to Cisco systems with diffie-hellman-group-exchange-sha1
507404 - Assigned to Gentoo's Team for Core System packages
=sys-devel/patch-2.7.1-r3 bails a dry run when a symlink is removed and a file with the same name is subsequently written
507656 - Assigned to Gentoo's Team for Core System packages
app-admin/logrotate: Unify how service are restarted/reloaded on openRC and systemd for logrotate
509366 - Assigned to Gentoo's Team for Core System packages
dev-libs/openssl: Add use flags to disable insecure protocols/ciphers
510798 - Assigned to Gentoo's Team for Core System packages
net-misc/rsync - make unit file honor -c option
511958 - Assigned to Gentoo systemd Team
sys-apps/grep-2.16[pcre] with dev-libs/libpcre[-jit]: segmentation fault in match (...) at pcre_exec.c:2621
514454 - Assigned to Gentoo's Team for Core System packages
sys-libs/db-6.0 warning: extra tokens at end of #ifdef directive
519140 - Assigned to Gentoo's Team for Core System packages
sys-fs/mdadm - /etc/init.d/mdraid: mdadm -As returns error 1 when the kernel has already assembled an array
521280 - Assigned to Gentoo's Team for Core System packages
sys-apps/kexec-tools - recovery kernel not starting busybox
521782 - Assigned to Yuan Liao (Leo3418)
sys-apps/mlocate - /etc/updatedb.conf: add davfs to PRUNEFS
521956 - Assigned to Gentoo's Team for Core System packages
sys-fs/cryptsetup testsuite does not handle missing kernel config options well
522684 - Assigned to Gentoo's Team for Core System packages
sys-apps/rename-1.3 - lowcasing doesn't work for russian letters
524186 - Assigned to Gentoo's Team for Core System packages
sys-apps/sysvinit - add support for root unmounting
524404 - Assigned to Gentoo's Team for Core System packages
net-misc/dhcp: add support for interface specific systemd service files
524686 - Assigned to Gentoo's Team for Core System packages
net-misc/dhcp: hostname resolution fails in chroot mode
524780 - Assigned to Gentoo's Team for Core System packages
sys-fs/e2fsprogs-1.42.10 - e4defrag -v causes print errors
525556 - Assigned to Gentoo's Team for Core System packages
sys-apps/logwatch: emerge.log parsing broken since Perl 5.18.x
526752 - Assigned to Gentoo's Team for Core System packages
sys-apps/hdparm-9.45 with llvm-core/clang-3.5.0 - x86_64-pc-linux-gnu-clang-3.5.0: error: unknown argument: '-fkeep-inline-functions'
527274 - Assigned to Gentoo's Team for Core System packages
sys-fs/lvm2 - add USE=python for Python bindings
528122 - Assigned to Gentoo's Team for Core System packages
sys-apps/util-linux-2.25.2 - dmesg --version: segmentation fault in color_fdisable (f=0xb6fc29b8 <_IO_2_1_stdout_>) at .../work/util-linux-2.25.2/lib/colors.c:695
528292 - Assigned to Gentoo's Team for Core System packages
net-misc/openssh-6.7_p1[sctp]: configure: error: *** Can not use SCTP - maybe libsctp-dev is missing ***
529436 - Assigned to Patrick McLean
net-fs/nfs-utils[-nfsv3]: /etc/init.d/nfs should not "need rpc.statd"
529568 - Assigned to Gentoo's Team for Core System packages
net-firewall/iptables: circular dependencies in systemd restore service units
531390 - Assigned to Gentoo's Team for Core System packages
net-misc/dhcp - /sbin/dhclient-script should source scripts in /etc/dhcp/dhclient-exit-hooks.d/ and /etc/dhcp/dhclient-enter-hooks.d/
531532 - Assigned to Gentoo's Team for Core System packages
net-misc/openssh-6.7_p1 connecting to older openssh server - Received disconnect from XXX.XXX.XXX.XXX: 2: Corrupted MAC on input.
532692 - Assigned to Gentoo's Team for Core System packages
virtual/dev-manager should depend on a dummy package for cases where no userland device manager is used
532928 - Assigned to Gentoo's Team for Core System packages
sys-apps/kbd - multiple wrong key mappings with keymap="de"
537048 - Assigned to Gentoo's Team for Core System packages
sys-process/cronbase: run-crons: add code to display script name for cron.{h,d,w,m}*
540274 - Assigned to Gentoo's Team for Core System packages
net-fs/nfs4-acl-tools-0.3.3:FATAL ERROR: libtool does not seem to be installed.
541356 - Assigned to Gentoo's Team for Core System packages
dev-debug/strace-4.10 fails test stat64-v.test on amd64
542632 - Assigned to Gentoo's Team for Core System packages
net-fs/nfs-utils: rpc.statd should be run as non-root
544164 - Assigned to Gentoo's Team for Core System packages
sys-fs/xfsprogs - live ebuild request
547122 - Assigned to Gentoo's Team for Core System packages
sys-fs/cryptsetup-1.6.7: Recent "--key-file -" inclusion for GPG protected keys may cause problems on old systems
548040 - Assigned to Gentoo's Team for Core System packages
app-shells/bash - bashrc does not set the window title correctly for gnu screen
550104 - Assigned to Gentoo's Team for Core System packages
sys-fs/lvm2 on musl gives extra error messages on volume activation
550228 - Assigned to Gentoo's Team for Core System packages
sys-fs/e2fsprogs whole device check is inconsistent
551020 - Assigned to Gentoo's Team for Core System packages
sys-apps/mlocate: bug in search results after renaming indexed directory
551408 - Assigned to Gentoo's Team for Core System packages
app-shells/bash-4.3 w/ app-shells/bash-completion: cd autocomplete fail with [], () and {} in directory names
551874 - Assigned to Gentoo Shell Tools project
sys-apps/watchdog-5.14 clamps hardware timeout to 254s but not the interval
551900 - Assigned to Gentoo's Team for Core System packages
dev-build/libtool-2.4.6: tests fail without fortran compiler
552026 - Assigned to Gentoo's Team for Core System packages
sys-libs/readline: add support for athame (full vim support)
554314 - Assigned to Gentoo's Team for Core System packages
net-dialup/ppp-2.4.7-r1: installs /usr/bin/pppd u-w
554360 - Assigned to Gentoo's Team for Core System packages
net-misc/dhcpcd installs files u-w
554362 - Assigned to William Hubbs
sys-libs/db-6.0.30-r1: installs files u-w
554372 - Assigned to Gentoo's Team for Core System packages
net-misc/whois: external -liconv is not linked in when needed
554554 - Assigned to Gentoo's Team for Core System packages
net-firewall/ebtables-2.0.10.4: add REQUIRES_EXCLUDE="libebt*"
554582 - Assigned to Gentoo's Team for Core System packages
net-misc/openssh: init script lacks "need root" when SSH host keys are missing (error "Read-only file system")
554804 - Assigned to Gentoo's Team for Core System packages
sys-apps/coreutils-8.23[static] fails to compile: src/libstdbuf.so link throws PIC errors
555590 - Assigned to Gentoo's Team for Core System packages
sys-process/cronbase: run-crons: sub-jobs should be run with timeouts
555756 - Assigned to Gentoo's Team for Core System packages
net-firewall/iptables: ip6rules-save doesn't make space for the parameters SNPT and DNPT
556918 - Assigned to Gentoo's Team for Core System packages
dev-build/cmake - ninja generator does not support fortran compiler
558644 - Assigned to Gentoo's Team for Core System packages
app-text/manpager: arguments in $PAGER are not handled
559490 - Assigned to Gentoo's Team for Core System packages
net-misc/vconfig fails to compile with format-security
559692 - Assigned to Gentoo's Team for Core System packages
=net-dialup/mingetty-1.08 should depend on virtual/libiconv
559890 - Assigned to Gentoo's Team for Core System packages
net-firewall/ebtables: add systemd service files
560714 - Assigned to Gentoo's Team for Core System packages
sys-apps/util-linux-2.26.2 incorrect system time from rtc with clock="local" and hctosys
562958 - Assigned to Gentoo's Team for Core System packages
sys-fs/lvm2 cannot create or use cache volumes without USE=+thin
563316 - Assigned to Gentoo's Team for Core System packages
sys-boot/syslinux-6.03 built with ld.gold fails
563364 - Assigned to Gentoo's Team for Core System packages
sys-apps/shadow: add support for fcaps.eclass
564896 - Assigned to Gentoo's Team for Core System packages
net-misc/openssh-7.1_p1 won't allow "nxserver" to connect
565804 - Assigned to Gentoo's Team for Core System packages
sys-apps/shadow-4.1.5.1-r1: "su -c" breaks the shell's job control
565918 - Assigned to Gentoo's Team for Core System packages
dev-build/make: automatic linkage against dev-libs/libelf due to AC_FUNC_GETLOADAVG
569946 - Assigned to Gentoo's Team for Core System packages
net-misc/dhcp: dhcrelay6.service: Invalid environment assignment, ignoring: "lower-iface="
570026 - Assigned to Gentoo's Team for Core System packages
>=dev-debug/strace-4.11 fails tests execve-v.test, execve.test, readlink.test, umovestr2.test, and utime.test
570874 - Assigned to Gentoo's Team for Core System packages
sys-apps/lsb-release: /etc/lsb-release: should 'provide' more 'information'
572078 - Assigned to Gentoo's Team for Core System packages
net-misc/dhcp: systemd service file for dhcpd6.service should point to seperate dhcp6.conf file
572804 - Assigned to Gentoo's Team for Core System packages
sys-apps/kexec-tools: update config files for new linux-4.3 kexec knobs
574054 - Assigned to Yuan Liao (Leo3418)
app-arch/rpm2targz: rpmoffset fails in some cases
576842 - Assigned to Gentoo's Team for Core System packages
net-nds/rpcbind-0.2.2-r1 : src/rpcb_svc_com.c:1298:6: error: ‘SVCXPRT {aka struct __rpc_svcxprt}’ has no member named ‘xp_auth’
577772 - Assigned to Gentoo's Team for Core System packages
net-misc/openssh: Last login message is the current login instead of previous
578594 - Assigned to Gentoo's Team for Core System packages
sys-apps/util-linux: make nofail be silent about ntfs if windows is hibernated
579876 - Assigned to Gentoo's Team for Core System packages
net-misc/dhcpcd: provide systemd service which delays network-online.target
582484 - Assigned to William Hubbs
sys-fs/e2fsprogs-1.43 fails tests
583490 - Assigned to Gentoo's Team for Core System packages
dev-libs/libgpg-error-1.22: cross-compiling fails with "src/syscfg/lock-obj-pub.<tuple>.h': No such file or directory"
584052 - Assigned to Gentoo's Team for Core System packages
>=dev-build/autoconf-2.59 fails test 501: Libtool
584144 - Assigned to Gentoo's Team for Core System packages
sys-apps/util-linux-2.28 fails tests on alpha: misc: setarch: [03] uname26-version
585364 - Assigned to Gentoo's Team for Core System packages
sys-fs/fuse-2.9.6 with sys-kernel/hardened-sources and musl: realpath is restricted causing mount failure
585564 - Assigned to Gentoo's Team for Core System packages
sys-fs/cryptsetup - dmcrypt initscript should support truecrypt device via options var
586360 - Assigned to Gentoo's Team for Core System packages
sys-fs/lvm2-2.02.145-r2 - pvscan Input/output error with not existing logical volume
586396 - Assigned to Gentoo's Team for Core System packages
sys-fs/xfsprogs-4.5.0: xfs_growfs: symbol lookup error: /lib64/libxfs.so.0: undefined symbol: uuid_compare
586884 - Assigned to Gentoo's Team for Core System packages
sys-libs/libieee1284 needs extra configure option applied when building on musl
590094 - Assigned to Gentoo musl team
net-fs/nfs-utils systemd unit files should start services selectively based on NFS version.
590632 - Assigned to Gentoo's Team for Core System packages
sys-apps/xinetd: -inetd_compat: /etc/inetd.conf port numbers not handled properly
590734 - Assigned to Gentoo's Team for Core System packages
sys-fs/cryptsetup does not work with PGP encrypted key files in boot runlevel: failed to create temporary file '/root/.gnupg/.#lk0x00.....': Read-only file system
591950 - Assigned to Gentoo's Team for Core System packages
sys-apps/baselayout: simplify the ebuild as much as possible
592104 - Assigned to William Hubbs
sys-apps/baselayout: look into automating updates of /etc/services
592392 - Assigned to William Hubbs
sys-apps/help2man dependents don't trigger dev-perl/Locale-gettext rebuilds during perl upgrade
592880 - Assigned to Gentoo Perl team
sys-block/thin-provisioning-tools-0.6.1 : ./.../block.tcc:193:68: error: throw will always call terminate() [-Werror=terminate]
595408 - Assigned to Robin Johnson
>=sys-fs/cryptsetup-1.6.8-r1 - dmcrypt init script hangs when GPG uses pinentry-curses
595586 - Assigned to Gentoo's Team for Core System packages
sys-block/thin-provisioning-tools-0.4.1 : ./.../space_map.h:125:9: error: deleted function 'virtual persistent_data::space_map_detail::missing_counts::~missing_counts()'
596210 - Assigned to Robin Johnson
net-misc/dhcp-4.3.3_p1 - sample.o: In function `set_key': sample.c:(.text+0x64): undefined reference to `isc_mem_create'
597084 - Assigned to Gentoo's Team for Core System packages
>=app-crypt/gnupg-2.1.15 breaks /etc/init.d/dmcrypt in runlevel boot
597406 - Assigned to Gentoo's Team for Core System packages
sys-apps/baselayout-2.3 fails if /usr/local is invalid symlink
598880 - Assigned to William Hubbs
dev-debug/strace-4.14 on PAX kernel fails test pc.test
600850 - Assigned to Gentoo's Team for Core System packages
dev-debug/strace-4.15[unwind], gold linker: error: strace-unwind.o: cannot make copy relocation for protected symbol '_UPT_accessors'
602908 - Assigned to Gentoo's Team for Core System packages
=sys-apps/util-linux-2.29 USE=-unicode - configure: error: wide-char support enabled, but non-wide ncurses selects
602972 - Assigned to Gentoo's Team for Core System packages
=sys-fs/lvm2-2.02.166 - thin_dump ignores vg_change --physicalextentsize
603204 - Assigned to Gentoo's Team for Core System packages
net-fs/nfs-utils with systemd should create /var/lib/nfs/v4recovery at run time
603628 - Assigned to Gentoo's Team for Core System packages
net-misc/openssh-7.4_p1: test failure: interop-tests: conch-ciphers.sh
605446 - Assigned to Gentoo's Team for Core System packages
sys-libs/db: rethinking the current slotting model (see comment #11 about how to properly RDEPEND on db)
605880 - Assigned to Gentoo's Team for Core System packages
sys-apps/file-5.2[59] - stale entry for magic(4) in /var/cache/man/cat4
606948 - Assigned to Gentoo's Team for Core System packages
sys-process/cronbase: wrong permissions on dirs lets any user to use cron.
607426 - Assigned to Gentoo's Team for Core System packages
sys-libs/db-5.3.28-r2:5.3 test failure
609122 - Assigned to Gentoo's Team for Core System packages
sys-libs/db:4.8 (maybe others) - add support for debian-compatible symbol versions
611336 - Assigned to Gentoo's Team for Core System packages
sys-apps/makedev-3.23.1 : /.../sh:line <snip>: 19323 Segmentation fault ./gendac960 > makedev.d/dac960
615188 - Assigned to Gentoo's Team for Core System packages
=dev-build/libtool-2.4.6-r6: libtool strips LDFLAGS/CFLAGS for "--param<space>option" style flags
615748 - Assigned to Gentoo's Team for Core System packages
sys-fs/cryptsetup-1.7.4: do not use hash in plain mode with keyfile specified
619048 - Assigned to Gentoo's Team for Core System packages
sys-libs/gpm-1.20.7-r2: unable to paste with middle click button
619552 - Assigned to Gentoo's Team for Core System packages
sys-apps/install-xattr: setxattr() failed: Operation not permitted - on hardened profile with FEATURES="userpriv" during src_compile as opposed to src_install
620524 - Assigned to Gentoo's Team for Core System packages
net-misc/dhcpcd-7.0.0 denyinterfaces ignored
621836 - Assigned to William Hubbs
sys-libs/db does not provide commands like "db_xxxx" instead of "db4.8_xxxx" and "db5.3_xxxx"
622988 - Assigned to Gentoo's Team for Core System packages
sys-libs/db-5.3.28-r2 : fails with FEATURES=test
623524 - Assigned to Gentoo's Team for Core System packages
dev-build/autoconf-2.63-r1 : fails with FEATURES=test ( 171. Unusual Automake input files (torture.at:1463): FAILED )
623994 - Assigned to Gentoo's Team for Core System packages
app-crypt/gnupg ipc socket handling violates sandbox
624308 - Assigned to Gentoo's Team for Core System packages
sys-firmware/intel-microcode: point to some instructions to update microcodes
624846 - Assigned to Gentoo's Team for Core System packages
dev-build/make-4.2.1-r1 : Error running /.../make (expected 0; got 14):
625306 - Assigned to Gentoo's Team for Core System packages
net-firewall/iptables-1.4.21-r4 will not build with USE static-libs and conntrack: ../extensions/libext.a(libxt_connlabel.o): In function `connlabel_open':
625364 - Assigned to Gentoo's Team for Core System packages
sys-libs/cracklib: creates unowned dictionary files, and does not clean them up on removal
627708 - Assigned to Gentoo's Team for Core System packages
sys-block/thin-provisioning-tools-0.7.0 : make: *** [unit-tests/Makefile:<snip>: unit-test]<snip> Segmentation fault
627886 - Assigned to Robin Johnson
sys-block/thin-provisioning-tools-0.7.0 : [ FAILED ] ArrayBlockTests.can_create_an_empty_array (6 ms)
628412 - Assigned to Robin Johnson
sys-apps/util-linux-2.30.1 : schedutils: chrt-non-user KNOWN FAILED (1 from 1 sub-tests)
629810 - Assigned to Gentoo's Team for Core System packages
sys-block/thin-provisioning-tools-0.7.1: block_cache.cc:(.text+0x15bc): undefined reference to `io_getevents'
630298 - Assigned to Robin Johnson
net-misc/openssh-7.5_p1-r2: cmp: /.../copy: No such file or directory
630658 - Assigned to Gentoo's Team for Core System packages
>=sys-block/thin-provisioning-tools-0.7.0 fails tests
631364 - Assigned to Robin Johnson
app-text/lesspipe-1.83 : less testok/a\ b NOT ok
632008 - Assigned to Gentoo's Team for Core System packages
net-misc/openssh-7.5_p1-r2: failed conch ciphers
632164 - Assigned to Gentoo's Team for Core System packages
sys-fs/e2fsprogs: test failure: m_hugefile
635210 - Assigned to Gentoo's Team for Core System packages
dev-libs/libusb-1.0.21 : Failed 4 tests
635320 - Assigned to Gentoo's Team for Core System packages
app-arch/bzip2: Handwritten Makefile to autotools conversion.
636546 - Assigned to Gentoo's Team for Core System packages
sys-apps/help2man-1.47.4: mess in infodir
636712 - Assigned to Gentoo's Team for Core System packages
sys-apps/sysvinit - /etc/inittab should be protected by CONFIG_PROTECT by default
637900 - Assigned to Gentoo's Team for Core System packages
sys-apps/coreutils-8.28-r1: stdbuf test fails
638578 - Assigned to Gentoo's Team for Core System packages
app-crypt/pinentry-1.0.0-r2: permission denied for root
640230 - Assigned to Gentoo's Team for Core System packages
sys-libs/pwdb-0.62-r1 : common/.../_pwdb_headers.h:23:10: fatal error: rpcsvc/ypclnt.h: No such file or directory
640986 - Assigned to Gentoo's Team for Core System packages
dev-libs/libgcrypt: Missing license for OCB >=1.7.0
641160 - Assigned to Gentoo's Team for Core System packages
>=sys-apps/grep-3.0 USE=static - /usr/lib64/libpcre.a(libpcre_la-pcre_jit_compile.o): In function `sljit_free_exec': (.text+0x133c): undefined reference to `pthread_mutex_lock'
641186 - Assigned to Gentoo's Team for Core System packages
dev-build/cmake: stores incorrect paths to lib64 libraries (?)
644538 - Assigned to Gentoo's Team for Core System packages
sys-fs/cryptsetup-1.7.5[selinux,static] fails to link: configure doesn't query selinux via pkg-config
644696 - Assigned to Gentoo's Team for Core System packages
sys-apps/net-tools should be removed from @system
645024 - Assigned to Gentoo's Team for Core System packages
sys-apps/util-linux-2.31.1 fails test: colcrt: regressions FAILED (1 from 3 sub-tests)
646560 - Assigned to Gentoo's Team for Core System packages
sys-apps/util-linux-2.31.1 - whereis: ordering of results does not respect $PATH (obeying EPREFIX)
647026 - Assigned to Gentoo's Team for Core System packages
sys-block/mtx-1.3.12 mtx fails when autochanger has many slots
647194 - Assigned to Gentoo's Team for Core System packages
sys-apps/less lesspipe cue sheet bug: ++ WARN: could not retrieve file info for `Rotting Christ - Passage to Arcturo.bin': No such file or directory
647258 - Assigned to Gentoo's Team for Core System packages
sys-apps/baselayout should own the /var/run symlink
648880 - Assigned to William Hubbs
net-misc/wget-1.19.1-r2 fails tests: testenv Test-504
649348 - Assigned to Gentoo's Team for Core System packages
net-fs/nfs4-acl-tools-0.3.3 : * ERROR: net-fs/nfs4-acl-tools-0.3.3::gentoo failed (configure phase):
649432 - Assigned to Gentoo's Team for Core System packages
net-misc/dhcp-4.3.6_p1 fails to start when network interface has multiple subnets: Interface enp3s0 matches multiple shared networks
649530 - Assigned to Gentoo's Team for Core System packages
sys-apps/kexec-tools does not appear to work with a xen server
651774 - Assigned to Yuan Liao (Leo3418)
sys-fs/cryptsetup - /etc/init.d/dmcrypt: add more options for keyfiles and temp device
653004 - Assigned to Gentoo's Team for Core System packages
app-shells/bash-4.4_p19 FEATURES=distcc - gcc -g -DCROSS_COMPILING -o mkbuiltins mkbuiltins.o: mkbuiltins.o: file not recognized: File format not recognized
653454 - Assigned to Gentoo's Team for Core System packages
sys-fs/fuse should install /sbin/umount.fuse
653594 - Assigned to Gentoo's Team for Core System packages
sys-apps/sysvinit-2.89-r1 spawns extra non-configured agetty on console tty
653672 - Assigned to Gentoo's Team for Core System packages
sys-process/lsof-4.91 - HOMEPAGE, SRC_URI are unavailable
653828 - Assigned to Gentoo's Team for Core System packages
net-fs/nfs-utils build fails on gentoo-on-android
653832 - Assigned to Gentoo's Team for Core System packages
sys-apps/util-linux: cross build fails - configure: error: systemd expected but libsystemd not found
653942 - Assigned to Gentoo's Team for Core System packages
net-libs/gnutls-3.6.7: dtls-repro-20170915 test fails
654918 - Assigned to Gentoo's Team for Core System packages
sys-apps/mlocate-0.26-r2: add an optional dependency on sys-power/powermgmt-base
655234 - Assigned to Gentoo's Team for Core System packages
sys-process/time-1.9-r1 fails test: FAIL: tests/time-max-rss.sh
655810 - Assigned to Gentoo's Team for Core System packages
sys-auth/sssd with =sys-libs/ldb-1.4.0-r1 - Failed to unlock db: ../ldb_tdb/ldb_tdb.c:147: Reusing ldb opend by pid 3340 in process 3341 / Protocol error
657954 - Assigned to Gentoo's Team for Core System packages
net-dialup/ppp-2.4.7-r6 : eap-tls.c:1210:7: error: SSL3_RT_HEADER undeclared (first use in this function)
658004 - Assigned to Gentoo's Team for Core System packages
sys-process/htop[delayacct]: add ~TASK_DELAY_ACCT to CONFIG_CHECK
658958 - Assigned to Gentoo's Team for Core System packages
sys-apps/acl-2.2.53 fails test: FAIL: test/cp.test
660598 - Assigned to Gentoo's Team for Core System packages
sys-apps/man-db-2.8.3 - Could not launch PAGER
661096 - Assigned to Gentoo's Team for Core System packages
app-arch/unzip fails to process zip64 files (patch)
661100 - Assigned to Gentoo's Team for Core System packages
dev-build/libtool-2.4.6-r3 test failure of "34: hardcoding library path"
661926 - Assigned to Gentoo's Team for Core System packages
sys-fs/cryptsetup-2.0.4-r1 askes for password for veracrypt volumes even when key file is specified
663918 - Assigned to Gentoo's Team for Core System packages
net-misc/openssh-7.7p1: openssh private key decryption breakage
664384 - Assigned to Gentoo's Team for Core System packages
sys-fs/e2fsprogs-1.44.4 fails to compile with error: missing binary operator before token "("
664806 - Assigned to Gentoo musl team
net-misc/openssh enable GTK-3 building/installing gnome-ssh-askpass3
665186 - Assigned to Gentoo's Team for Core System packages
sys-apps/keyutils: depends on app-crypt/mit-krb5 yet again
665530 - Assigned to Robin Johnson
sys-fs/cryptsetup-2.0.4-r1 fails test vectors-test
665732 - Assigned to Gentoo's Team for Core System packages
sys-fs/f2fs-tools: fsck.f2fs does never run for root mount
666657 - Assigned to Gentoo's Team for Core System packages
dev-libs/openssl uses -Werror when building the "depend" target
667614 - Assigned to Gentoo's Team for Core System packages
net-libs/ntirpc-1.7.0 : ../.../libntirpc.so.1.7.0: undefined reference to _mm_crc32_u64
669620 - Assigned to Gentoo's Team for Core System packages
net-libs/libtirpc: USE=static-libs doesn't enforce static build for virtual/krb5 dep (USE=kerberos)
670334 - Assigned to Gentoo's Team for Core System packages
sys-fs/lvm2-2.02.181 - /lib/systemd/system-generators/lvm2-activation-generator hardcodes /usr/bin/udevadm
672256 - Assigned to Gentoo's Team for Core System packages
dev-libs/openssl add versioned symbols from Debian
672526 - Assigned to Gentoo's Team for Core System packages
sys-devel/gettext: Ship ITS files for metainfo.xml translation rules
672570 - Assigned to Gentoo's Team for Core System packages
dev-db/sqlite dev-libs/libxml2 x11-wm/w3m with sys-libs/libtermcap-compat link against /usr/lib64/libtermcap.so.2
672768 - Assigned to Gentoo's Team for Core System packages
virtual/libusb should support USE=static-libs
672920 - Assigned to Gentoo's Team for Core System packages
sys-fs/lvm2 - lvremove on an active LV does not remove it from /dev
673242 - Assigned to Gentoo's Team for Core System packages
net-firewall/iptables-1.8.2-r2 with net-firewall/arptables - file collisions in /sbin/arptables-save /sbin/arptables-restore
674284 - Assigned to Gentoo's Team for Core System packages
net-misc/iputils-20180629 USE='-* idn' depends on but does not use net-dns/libidn2
674696 - Assigned to Gentoo's Team for Core System packages
net-misc/wget-1.20.1 USE=-* - src_test(): init.c:2008:14: error: 'struct options' has no member named 'hsts_file'; did you mean 'body_file'?
674698 - Assigned to Gentoo's Team for Core System packages
dev-libs/libbsd: should not depend on sys-kernel/linux-headers (but virtual/os-headers)
674950 - Assigned to Gentoo's Team for Core System packages
app-arch/tar-1.31: "compress: gzip" test fails
675146 - Assigned to Gentoo's Team for Core System packages
dev-libs/libpipeline-1.5.0 : make[2]: *** [Makefile:<snip>: fcntl.h] Error 1
676378 - Assigned to Gentoo's Team for Core System packages
>sys-devel/bison-3 - configure: add --enable-relocatable
676818 - Assigned to Gentoo's Team for Core System packages
net-firewall/iptables: failure to run iptables commands where kconfig option CONFIG_BPFILTER is set
678044 - Assigned to Gentoo's Team for Core System packages
sys-apps/coreutils-8.30: test-lock hangs
678306 - Assigned to Gentoo's Team for Core System packages
sys-apps/baselayout: include Gentoo logo
679358 - Assigned to William Hubbs
sys-fs/e2fsprogs-1.45.0-r1 with sys-process/dcron - /etc/cron.d/e2scrub_all uses usernames which dcron does no understand
679836 - Assigned to Gentoo's Team for Core System packages
=sys-auth/sssd-2.1.0 FEATURES=network-sandbox - configure: error: nsupdate does not support 'realm'
679838 - Assigned to Gentoo's Team for Core System packages
net-misc/openssh-7.9_p1-r4: manpages installed in wrong dir if only mandoc is installed
680012 - Assigned to Gentoo's Team for Core System packages
app-arch/bzip2 cannot be cross-emerged with mingw32
680220 - Assigned to Gentoo's Team for Core System packages
sys-apps/arrayprobe: HOMEPAGE and SRC_URI are down
680410 - Assigned to Gentoo's Team for Core System packages
sys-power/athcool: HOMEPAGE and SRC_URI are down
680414 - Assigned to Gentoo's Team for Core System packages
net-libs/gnutls-3.6.7: several test failures (tls11-check-rollback-val resume-dtls tls13/post-handshake-with-cert-ticket srp tls12-resume-psk tls12-resume-anon)
682572 - Assigned to Gentoo's Team for Core System packages
=sys-fs/lvm2-2.02.183 USE=udev leads to long delays in the initramfs
682578 - Assigned to Gentoo's Team for Core System packages
sys-apps/gawk-4.2.1-r1 on aarch64/musl fails tests clos1way6 testext
682666 - Assigned to Gentoo's Team for Core System packages
sys-fs/lvm2-2.02.183 - systemd fails to stop dmeventd
682670 - Assigned to Gentoo's Team for Core System packages
dev-build/autoconf-2.69-r4 on aarch64/musl fails 135 tests
682682 - Assigned to Gentoo's Team for Core System packages
sys-apps/smartmontools: Merging new version doesn't update existing drivedb.h
683104 - Assigned to Gentoo's Team for Core System packages
dev-libs/openssl-1.1.0j-r1 fails tests: Failed test: 1
684424 - Assigned to Gentoo's Team for Core System packages
sys-apps/acl-2.2.53 with sys-apps/sed[forced-sandbox]: make[1]: *** No rule to make target all . Stop.
684762 - Assigned to Gentoo's Team for Core System packages
>=sys-fs/lvm2-2.02.184 - systemd[1]: Timed out waiting for device /dev/mapper/gentoo-swap.
684882 - Assigned to Gentoo's Team for Core System packages
net-nds/gssproxy-0.8.2 : configure: error: GSSAPI library does not support gss_import_cred
686610 - Assigned to Gentoo's Team for Core System packages
sys-firmware/intel-microcode: installation will fail when /boot is mounted ro only
686830 - Assigned to Gentoo's Team for Core System packages
sys-apps/netkit-base MCONFIG file generation uncompatible dash/(POSIX) echo
687382 - Assigned to Gentoo's Team for Core System packages
sys-fs/cryptsetup-2* : missing kernel checks for luks2 support
688140 - Assigned to Gentoo's Team for Core System packages
sys-apps/coreutils-8.31 USE=static - libc.a(malloc.o): relocation R_AARCH64_ADR_PREL_PG_HI21 against symbol `_dl_tunable_set_mallopt_check' which may bind externally can not be used when making a shared object; recompile with -fPIC
689366 - Assigned to Gentoo's Team for Core System packages
sys-apps/iproute2-5.2.0 USE=berkdb - ld: error: cannot find -ldb
690142 - Assigned to Gentoo's Team for Core System packages
sys-fs/lvm2-2.02.184-r4 delayed boot with multiple "WARNING: Device /dev/sdaX not initialized in udev database even after waiting 10000000 microseconds"
690494 - Assigned to Gentoo's Team for Core System packages
net-firewall/ebtables: support running 32-bit ebtables on 64-bit kernel
690542 - Assigned to Gentoo's Team for Core System packages
net-misc/openssh-7.9_p1-r4: ssl USE flag message could be made more explicit
690954 - Assigned to Gentoo's Team for Core System packages
sys-libs/ncurses-6.1_p20190609 - pinfo open: segmentation fault in termattrs_sp (sp=sp@entry=0x555555573770) at /usr/src/debug/sys-libs/ncurses-6.1_p20190609/ncurses-6.1/ncurses/tty/lib_vidattr.c:381
692954 - Assigned to Gentoo's Team for Core System packages
dev-build/autoconf-2.69-r4 fails tests: ERROR: 493 tests were run,
693616 - Assigned to Gentoo's Team for Core System packages
sys-process/cronbase: QA issues
694866 - Assigned to Gentoo's Team for Core System packages
net-misc/wget: QA issues
695128 - Assigned to Gentoo's Team for Core System packages
sys-libs/ncurses-6.1_p20190609 - x86_64-pc-linux-gnu-gcc ... -masm=intel ... ../objects/lib_longname.o: Assembler messages: {standard input}:113: Error: invalid use of register
695736 - Assigned to Gentoo's Team for Core System packages
net-misc/openssh: enable +libedit by default
696052 - Assigned to Gentoo's Team for Core System packages
dev-libs/libusb-compat-0.1.12: version bump
696536 - Assigned to Gentoo's Team for Core System packages
dev-libs/openssl-1.1.1d-r2[asm] - ld: apps/ca.o: in function `ca_main': ca.c:(.text+0x3694): undefined reference to `OPENSSL_cleanse'
697560 - Assigned to Gentoo's Team for Core System packages
sys-libs/ncurses backspace patch
698318 - Assigned to Gentoo's Team for Core System packages
dev-libs/libgcrypt: incomplete license
698326 - Assigned to Gentoo's Team for Core System packages
net-misc/openssh-8.0_p1-r4 USE=static with dev-libs/openssl-1.1.1d-r2 - configure: error: *** working libcrypto not found, check config.log
699384 - Assigned to Gentoo's Team for Core System packages
=sys-fs/xfsprogs-5.3.0 should not install static library /usr/lib64/libhandle.a (?)
700542 - Assigned to Gentoo's Team for Core System packages
sys-apps/rng-tools-6.7-r2 fails rngtesturandom.sh test
703836 - Assigned to Gentoo's Team for Core System packages
net-firewall/nftables-0.9.0-r5 reads from stdin on system boot
704186 - Assigned to SE Linux Bugs
net-misc/dhcpcd-7.2.3 - connections dropped(?)
708866 - Assigned to William Hubbs
sys-apps/netkit-base-0.17-r9 : ebuild uses colon (:) as a sed delimiter
710896 - Assigned to Gentoo's Team for Core System packages
dev-build/automake-1.16.1-r2 fails test "t/dist-formats.tap 45 - ac=dist-zip,no-dist-gzip [distcheck]"
711424 - Assigned to Gentoo's Team for Core System packages
sys-apps/ifplugd-0.28-r10: Error "NLAPI: Packet too small or truncated"
711742 - Assigned to Gentoo's Team for Core System packages
sys-devel/bison-3.5.2 causes sandbox access violation
711804 - Assigned to Gentoo's Team for Core System packages
sys-libs/db-6.0.35-r2 fails tests: * Some tests failed, please see /var/tmp/portage/sys-libs/db-6.0.35-r2/work/db-6.0.35/build_unix-a
712274 - Assigned to Gentoo's Team for Core System packages
sys-libs/libieee1284-0.2.11-r8 : /.../ld: ./.../libieee1284.so: undefined reference to outb_p
712676 - Assigned to Gentoo musl team
net-misc/ethercard-diag-20050321.1g-r1 : alta-diag.c: error: unknown type name u_int32_t
712686 - Assigned to Gentoo musl team
sys-apps/qingy-1.0.0-r6 : misc.h: error: unknown type name time_t
713398 - Assigned to Gentoo musl team
sys-apps/dnotify-0.18.0-r1 : configure: error: kernel has fl_owner bug
713842 - Assigned to Gentoo musl team
sys-apps/xinetd-2.3.15.3 comes w/ two not working example configuration files
714124 - Assigned to Gentoo's Team for Core System packages
sys-fs/autorun-3.17 : autorun.cc: error: redefinition of struct argp_option
714140 - Assigned to Gentoo musl team
sys-block/gpart-0.3-r1 : l64seek.h: error: unknown type name loff_t
715842 - Assigned to Gentoo musl team
net-libs/gnutls-3.6.14 kills too many processes (including sandbox) when 'key-material-dtls' test fails
715888 - Assigned to Gentoo's Team for Core System packages
sys-apps/coreutils[multicall]: readelf issue
716164 - Assigned to Gentoo's Team for Core System packages
sys-fs/cramfs-1.1 : mkcramfs.c: error: unknown type name loff_t
716190 - Assigned to Gentoo musl team
sys-apps/netkit-base-0.17-r9 : inetd.c: error: _environ undeclared (first use in this function)
716372 - Assigned to Gentoo musl team
=sys-apps/util-linux-2.33.2: script/options-size test failure
716402 - Assigned to Gentoo's Team for Core System packages
sys-libs/pwdb-0.62-r1 : make[1]: *** [Makefile:<snip>: common/commonio.o] Error 1
716462 - Assigned to Gentoo musl team
net-misc/netkit-fingerd-0.17-r3 : lprint.c: error: O_RDONLY undeclared (first use in this function)
716582 - Assigned to Gentoo musl team
sys-apps/readahead-list-1.20060421.1016-r3 : readahead-list.c: error: loff_t undeclared (first use in this function)
717428 - Assigned to Gentoo musl team
dev-libs/openssl-compat-1.0.2u-r2 does not respect LDFLAGS
719172 - Assigned to Gentoo's Team for Core System packages
dev-libs/openssl fails tests
719688 - Assigned to Gentoo's Team for Core System packages
sys-apps/util-linux misc: mountpoint test fails
720078 - Assigned to Gentoo's Team for Core System packages
sys-apps/util-linux-2.35.1-r2 - test failures: ipcs/mk-rm-msg, ipcs/mk-rm-sem, and ipcs/mk-rm-shm
720232 - Assigned to Gentoo's Team for Core System packages
sys-apps/util-linux-2.35.1-r2 su: cannot get groups: Operation not permitted
722538 - Assigned to Gentoo's Team for Core System packages
sys-block/tapecat calls cc directly
725800 - Assigned to Robin Johnson
sys-fs/lufs-0.9.7-r4 does not respect CFLAGS
725994 - Assigned to Gentoo's Team for Core System packages
sys-apps/gawk-5.0.1: tests fail
726204 - Assigned to Gentoo's Team for Core System packages
net-misc/dhcp - dhclient fails to bring up interface due to some issue in /var/lib/dhcp/dhclient.leases
726696 - Assigned to Gentoo's Team for Core System packages
net-libs/gnutls-3.6.14: cannot create regular file 'srptool-args.h': Permission denied
727270 - Assigned to Gentoo's Team for Core System packages
sys-apps/coreutils-8.32-r1: help2man: can't get `--help' info from man/dircolors.td/dircolors
727710 - Assigned to Gentoo's Team for Core System packages
sys-apps/kbd fails test dumpkeys-bkeymap on big-endian archs
727822 - Assigned to Gentoo's Team for Core System packages
sys-apps/kbd-2.2.0-r2: dumpkeys segmentation fault
728454 - Assigned to Gentoo's Team for Core System packages
app-arch/dump installs compressed files (manpages, documentation)
729138 - Assigned to Gentoo's Team for Core System packages
net-misc/rsync-3.2.0-r1[zstd]: configure.sh: error: Failed to find ZSTD_minCLevel function in zstd lib.
729186 - Assigned to Gentoo's Team for Core System packages
app-doc/tldp-howto installs compressed files (manpages, documentation)
729250 - Assigned to Gentoo's Team for Core System packages
sys-apps/util-linux-2.38.1-r2: flock tests fail on hppa and sparc
729846 - Assigned to Gentoo's Team for Core System packages
net-misc/rsync: Don't install rsync-ssl with USE=-openssl
730470 - Assigned to Gentoo's Team for Core System packages
sys-apps/kexec-tools-2.0.20-r1 fails to compile: purgatory/arch/i386/entry32-16.S:23:2: error: unknown directive
732050 - Assigned to Yuan Liao (Leo3418)
app-shells/bash calls size directly
732530 - Assigned to Gentoo's Team for Core System packages
sys-apps/util-linux-2.36 fails lsblk tests: FAILED (14 from 14 sub-tests)
733748 - Assigned to Gentoo's Team for Core System packages
net-fs/nfs-utils with sys-libs/musl : underlinking of libnfsidmap plugins - Error relocating nsswitch.so: nfs4_get_default_domain: symbol not found
734022 - Assigned to Gentoo musl team
app-text/lesspipe-1.84 fails tests
734896 - Assigned to Gentoo's Team for Core System packages
dev-libs/openssl-compat-1.0.2u-r2 fails to compile: rc5_skey.c:119:32: error: unsupported inline asm: input with type 'unsigned long' matching output with type 'unsigned int'
737204 - Assigned to Gentoo's Team for Core System packages
app-arch/cpio-2.12-r1 fails symlink-long test
738392 - Assigned to Gentoo's Team for Core System packages
app-admin/sudo-1.9.2 : configure: error: Cannot mix mutually exclusive (PAM) and regular (S/Key) authentication methods
738414 - Assigned to Gentoo's Team for Core System packages
dev-debug/strace-5.8[elfutils,static]: undefined reference to `dlopen'
738508 - Assigned to Gentoo's Team for Core System packages
net-misc/openssh doesn't kill active sessions when the machine is rebooted
738640 - Assigned to Gentoo's Team for Core System packages
sys-libs/db-3.2.9_p2-r1 calls ar directly
739182 - Assigned to Gentoo's Team for Core System packages
sys-libs/db-1.85-r4 does not respect LDFLAGS
739214 - Assigned to Gentoo's Team for Core System packages
app-arch/unzip-6.0_p25-r1 : fails to unzip
743328 - Assigned to Gentoo's Team for Core System packages
sys-firmware/intel-microcode : remove 0x000406f1 from microcode blacklist
744022 - Assigned to Gentoo's Team for Core System packages
sys-apps/iproute2: rtnl_wilddump_request() is gone but still advertised on manpage
744751 - Assigned to Gentoo's Team for Core System packages
dev-libs/nettle-3.6-r2[doc] fails src_configure without sys-apps/texinfo ( configure: error: Cannot find 'makeinfo', required for documentation )
749831 - Assigned to Gentoo's Team for Core System packages
net-misc/openssh-8.1_p1-r4[sctp]: Transport SCTP directive applies to all hosts
751721 - Assigned to Patrick McLean
net-firewall/iptables add short option for --line-numbers (PATCH)
753425 - Assigned to Gentoo's Team for Core System packages
sys-apps/pciutils-3.6.4: lspci: Unable to load libkmod resources:
754303 - Assigned to Gentoo's Team for Core System packages
sys-devel/bc: bc-1.07.1-use-system-bc.patch - needs sys-devel/bc in BDEPEND
759109 - Assigned to Gentoo's Team for Core System packages
dev-build/cmake: PROCESSOR_AFFINITY doesn't work due to unbundled libuv
759217 - Assigned to Gentoo's Team for Core System packages
sys-apps/ifplugd unwanted default behavior
761993 - Assigned to Gentoo's Team for Core System packages
sys-apps/smartmontools-7.2 the emerge warning is unclear whether it's a) AND b) or a) OR b)
763219 - Assigned to Gentoo's Team for Core System packages
sys-libs/gdbm-1.19 - test failure: version
764431 - Assigned to Gentoo's Team for Core System packages
sys-process/numactl-2.0.14: checktopology fails on sparc
767856 - Assigned to Gentoo's Team for Core System packages
app-crypt/pinentry-1.1.1: broken border depending on terminal size
768288 - Assigned to Gentoo's Team for Core System packages
sys-libs/ncurses-compat: add --with-versioned-symbols support
771621 - Assigned to Gentoo's Team for Core System packages
app-shells/bash-4.3_p48-r2 calls commands that do not exist
772986 - Assigned to Gentoo's Team for Core System packages
sys-apps/sysvinit: add pf:12345:powerwait:/sbin/halt back to inittab
777459 - Assigned to William Hubbs
dev-util/dialog-1.3.20240101 - rlibtool: error logged in slbt_lconf_open(), line 597: flow error: unexpected condition or other.
778047 - Assigned to Gentoo's Team for Core System packages
net-misc/dhcp-4.4.3_p1-r5 - rdlibtool: error: --mode must be specified.
778479 - Assigned to Gentoo's Team for Core System packages
sys-fs/multipath-tools: /etc/init.d/multipath won't load dm-multipath module
780429 - Assigned to Gentoo's Team for Core System packages
app-misc/ca-certificates - update-ca-certificates symlink generation varies based on --root
784062 - Assigned to Gentoo's Team for Core System packages
sys-apps/mlocate-0.26-r3: find ... File name too long
785580 - Assigned to Gentoo's Team for Core System packages
app-editors/nano-5.6.1[static]: fails to build ((.text+0x758): undefined reference to `dlclose')
786969 - Assigned to Gentoo's Team for Core System packages
net-firewall/nftables: hardcoded "flush ruleset" prevents custom flush rules
789306 - Assigned to Matthew Thode ( prometheanfire )
sys-block/thin-provisioning-tools-0.9.0: fails 94 tests on ppc
790584 - Assigned to Robin Johnson
acct-user/root-0-r3: The ebuild is installing to one or more unexpected paths: /root
793818 - Assigned to Portage team
net-misc/openssh: Please add support KRB5CCNAME=KCM:
795135 - Assigned to Gentoo's Team for Core System packages
dev-libs/libgpg-error-1.42 fails test t-argparse
796602 - Assigned to Gentoo's Team for Core System packages
net-misc/dhcpcd: interface_mtu option broken? (was: >sys-kernel/gentoo-sources-5.4.72 breaks webrtc (Google Meet, Discord, possibly others) when forwarding (i.e. in a gateway))
797211 - Assigned to William Hubbs
sys-fs/cryptsetup - dmcrypt init script should execute post_mount
802198 - Assigned to Gentoo's Team for Core System packages
sys-apps/qingy resetting terminal trigger has incorrect behavoiur
804975 - Assigned to Gentoo's Team for Core System packages
dev-build/cmake: RunCMake.CPack_TXZ fails (library: Cannot allocate memory)
806779 - Assigned to Gentoo's Team for Core System packages
dev-build/meson: LD_LIBRARY_PATH set in the environment overrides DT_RUNPATH on binaries invoked during builds (x11-misc/colord-1.4.5-r1 fails to build with "undefined symbol: cd_icc_set_created")
812698 - Assigned to Gentoo's Team for Core System packages
dev-libs/openssl: introduce USE=hardened with stronger defaults (based on dev-lang/python)
812794 - Assigned to Gentoo's Team for Core System packages
net-misc/chrony: Failed to load seccomp rules
815472 - Assigned to Sam James
dev-build/cmake-3.20.5 emerge fail when using libcxx systemwide
816714 - Assigned to Gentoo's Team for Core System packages
net-libs/ntirpc-3.4 - -- KRB5 was not found. Make sure the entries KRB5_ are set.
819663 - Assigned to Gentoo's Team for Core System packages
app-crypt/gnupg-2.3.3: gettime.c:(.text+0x6f4): undefined reference to `bug_at'
820272 - Assigned to Gentoo's Team for Core System packages
sys-libs/ncurses-6.3: fails to cross-build for x86_64-w64-mingw32 (with the same version installed in the base system)
820506 - Assigned to Gentoo's Team for Core System packages
dev-libs/libpcre-8.45: Missing /usr/lib64/libpcre.so.1 library
820635 - Assigned to Gentoo's Team for Core System packages
app-admin/sudo-1.9.8_p2: fails tests with sandbox namespaces enabled
820686 - Assigned to Gentoo's Team for Core System packages
sys-fs/lufs-0.9.7-r4 has a configure.in file which has long been deprecated
823814 - Assigned to Gentoo's Team for Core System packages
media-libs/libpng: dropping "apng" patches
824018 - Assigned to Gentoo's Team for Core System packages
sys-block/thin-provisioning-tools-0.9.0 fails tests: - /.../gtest-printers.h: error: no matching function for call to testing::internal:
825006 - Assigned to Robin Johnson
dev-db/sqlite doesn't set byte order during configure
828101 - Assigned to Jakov Smolić
sys-devel/gettext-0.21-r1: fails with unknown configure arguments
828565 - Assigned to Gentoo's Team for Core System packages
net-libs/ntirpc-4.0-r1 - Could NOT find NSL (missing: NSL_LIBRARY)
828709 - Assigned to Gentoo's Team for Core System packages
net-misc/ethercard-diag-20050321.1g-r2 - /.../if_ether.h: error: redefinition of struct ethhdr
828979 - Assigned to Gentoo musl team
sys-apps/iproute2 missing CONFIG_CHECK for ss tool
828993 - Assigned to Gentoo's Team for Core System packages
net-fs/nfs4-acl-tools-0.3.7 - sandbox issue
829157 - Assigned to Gentoo musl team
app-shells/bash-3.1_p23 and app-shell/bash-3.2_p57 fails to compile: printf.def:552:5: error: non-void function printstr should return a value [-Wreturn-type]
829166 - Assigned to Gentoo's Team for Core System packages
sys-libs/pwdb-0.62-r2 - common/.../public.h: error: unknown type name _uid_t
829174 - Assigned to Gentoo musl team
sys-apps/netkit-base-0.17-r9 - pingpack.h: error: redefinition of struct ip
829248 - Assigned to Gentoo musl team
net-dialup/ppp-2.4.9-r5 - leases.h: error: unknown type name u_int8_t
829249 - Assigned to Gentoo musl team
sys-devel/bison-3.8.2 fails to build; ACCESS DENIED fopen_wr: /proc/self/coredump_filter
829566 - Assigned to Gentoo's Team for Core System packages
dev-libs/libusb-1.0.24-r2 - make: [Makefile:<snip>: api-1.0]<snip> Segmentation fault
830043 - Assigned to Gentoo musl team
net-dialup/ppp-2.4.9-r5 calls commands that do not exist
830246 - Assigned to Gentoo's Team for Core System packages
net-misc/openssh: Modify OpenRC init script to enable control of SSH HostKey algorithm generation
831762 - Assigned to Gentoo's Team for Core System packages
sys-apps/man-db-2.9.4-r1: /etc/cron.daily/man-db uses su which is not installed
832182 - Assigned to Gentoo's Team for Core System packages
sys-apps/qingy-1.0.0-r5 fails to compile: vt.c:104:10: error: assignment of read-only variable stdin
832905 - Assigned to Gentoo's Team for Core System packages
app-crypt/gnupg fails test when net-misc/openssh is compiled with USE="-ssl"
833148 - Assigned to Gentoo's Team for Core System packages
dev-libs/libpcre2-10.40 fails tests on MUSL: FAIL: RunGrepTest
834351 - Assigned to Gentoo's Team for Core System packages
dev-libs/libxml2-2.9.14-r1 fails tests on MUSL
834365 - Assigned to Sam James
sys-apps/smartmontools RDEPEND on virtual/mta
834535 - Assigned to Gentoo's Team for Core System packages
net-misc/rsync fails to cross compile for musl (CBUILD=x86_64-pc-linux-gnu, CHOST=x86_64-pc-linux-musl)
834978 - Assigned to Gentoo's Team for Core System packages
sys-fs/cryptsetup-2.4.3-r1 - tokens/.../ssh-utils.c: fatal error: libssh/sftp.h: No such file or directory
834990 - Assigned to Gentoo's Team for Core System packages
net-misc/wget-1.21.3 fails test - FAIL: Test-auth-no-challenge-url.px
836404 - Assigned to Gentoo's Team for Core System packages
net-dns/c-ares-1.18.1 fails tests on MUSL
836591 - Assigned to Gentoo's Team for Core System packages
net-libs/libnftnl-1.2.3 fails tests on MUSL: nft-rule-add.c:112:21: error: struct tcphdr has no member named dest
836631 - Assigned to Gentoo's Team for Core System packages
app-crypt/gnupg fails to correctly identify mail-mta/sendmail binary location
836682 - Assigned to Gentoo's Team for Core System packages
sys-apps/acl-2.3.1-r1 fails tests on MUSL: FAIL: misc.test
837386 - Assigned to Gentoo's Team for Core System packages
sys-apps/gawk-5.1.1-r1 fails tests (hang) on MUSL
837695 - Assigned to Gentoo's Team for Core System packages
sys-apps/keyutils-1.6.3 fails tests on MUSL
837773 - Assigned to Robin Johnson
sys-apps/man-db-2.10.2-r1 fails tests on MUSL
837776 - Assigned to Gentoo's Team for Core System packages
sys-libs/libnvme-1.0 fails to compile: fabrics.c:328:31: error: SCOPE_DELIMITER undeclared (first use in this function)
838169 - Assigned to Zac Medico
sys-process/numactl-2.0.14-r1 fails tests on MUSL
838178 - Assigned to Gentoo's Team for Core System packages
net-libs/ntirpc-5.0 - CMake Error: The following variables are used in this project, but they are set to NOTFOUND.
839510 - Assigned to Gentoo musl team
sys-fs/e2fsprogs-1.46.5-r1 - sandbox issue
839825 - Assigned to Gentoo's Team for Core System packages
sys-devel/gettext-0.21-r1 - sandbox issue
840505 - Assigned to Gentoo's Team for Core System packages
sys-fs/fuse-3.10.5 vs gnome-base/gvfs-1.48.1-r1: gvfsd-fuse: command not found
840650 - Assigned to Gentoo Linux Gnome Desktop Team
sys-libs/cracklib-2.9.7 fails test - ERROR: test_VeryFascistCheck (test_cracklib.TestModuleFunctions)
841197 - Assigned to Gentoo's Team for Core System packages
sys-apps/keyutils-1.6.3 fails tests
844025 - Assigned to Robin Johnson
dev-build/autoconf-archive-2021.02.19 - broken Qt5 detection using AX_HAVE_QT macro
851195 - Assigned to Gentoo's Team for Core System packages
app-editors/nano incorrect sed in ebuild src_install
851726 - Assigned to Gentoo's Team for Core System packages
sys-apps/netkit-base-0.17-r10 installs shell script that uses non-POSIX features
851813 - Assigned to Gentoo's Team for Core System packages
sys-block/vblade-25 installs shell script that uses non-POSIX features
852062 - Assigned to Gentoo's Team for Core System packages
sys-fs/lufs-0.9.7-r4 installs libtool files (.la) without corresponding static libraries
852170 - Assigned to Gentoo's Team for Core System packages
sys-fs/udftools-2.3 installs udev rules without inheriting udev.eclass
852176 - Assigned to Gentoo's Team for Core System packages
sys-block/partimage-0.6.9-r3 - partimaged-client.cpp: error: cannot convert std::nullptr_t to int in assignment
853883 - Assigned to Gentoo musl team
sys-apps/minised: update HOMEPAGE
854342 - Assigned to Embedded Gentoo Team
sys-block/nbd-3.24 fails tests on stable arm
858359 - Assigned to Gentoo's Team for Core System packages
app-admin/logrotate does complain about world readable lock even if it is not
858422 - Assigned to Gentoo's Team for Core System packages
net-nds/rpcbind-1.2.6 - rpcbind.c:(<snip>) undefined reference to _nss_configure_lookup
862651 - Assigned to Gentoo musl team
dev-build/autoconf-dickey-2.52_p20210509 fails tests: conftest.c:(.text.startup+0x7): undefined reference to Be_doomed_if_your_libc_has_a_function_named_like_this
869443 - Assigned to Gentoo's Team for Core System packages
sys-apps/man-pages-posix-2017a: LICENSE is non-free and blocks modification
871636 - Assigned to Gentoo's Team for Core System packages
app-arch/zstd: cmake config file is unavailable
872254 - Assigned to Gentoo's Team for Core System packages
sys-apps/file-5.43 fails tests (MUSL)
874480 - Assigned to Gentoo's Team for Core System packages
sys-apps/gawk-5.1.1-r2 calls commands that do not exist: locale
874636 - Assigned to Gentoo's Team for Core System packages
sys-libs/db-6.0.35-r4: Failed running 'autoconf'! (error: possibly undefined macro: AC_PROG_JAVAC)
875335 - Assigned to Gentoo's Team for Core System packages
dev-libs/openssl-compat-1.0.2u-r2 - t1_lib.c: error: call to undeclared function kssl_tgt_is_available; ISO C99 and later do not s
875512 - Assigned to Gentoo's Team for Core System packages
sys-block/thin-provisioning-tools-0.9.0-r1 fails tests (MUSL): optional.hpp:1656:3: error: static assertion failed: If you want to output boost::optional, include header optional_io.hpp>
875590 - Assigned to Robin Johnson
dev-build/libtool-2.4.7 fails tests (MUSL)
875629 - Assigned to Gentoo's Team for Core System packages
app-misc/ca-certificates creates files with special characters below /etc
876193 - Assigned to Gentoo's Team for Core System packages
net-dns/c-ares uses hardcoded paths to /etc outside of prefix
877003 - Assigned to Gentoo's Team for Core System packages
net-libs/gnutls-3.7.7: fails to compile (nettle/mac.c:766:31: error: 'streebog512_update' undeclared (first use in this function); did you mean 'streebog512_ctx'?)
877361 - Assigned to Gentoo's Team for Core System packages
net-fs/nfs-utils-2.6.1: build without nis support, using internal rpcgen tool
877427 - Assigned to Gentoo's Team for Core System packages
sys-apps/less has incorrect LICENSE
877735 - Assigned to Gentoo's Team for Core System packages
sys-block/open-iscsi-2.1.4-r2 mistakenly claims SCSI_ISCSI_ATTRS and ISCSI_TCP cannot be built-in to kernel
878013 - Assigned to Gentoo's Team for Core System packages
sys-fs/lvm2-2.03.14-r3[device-mapper-only]: dmsetup is compiled in the install phase
878131 - Assigned to Gentoo's Team for Core System packages
sys-devel/gettext-0.21.1 fails test - FAIL: test-execute.sh
879059 - Assigned to Gentoo's Team for Core System packages
>=app-admin/sudo-1.9.11_p3-r1: directory /etc/sudoers.d is missing
879179 - Assigned to Gentoo's Team for Core System packages
sys-apps/less: becomes unresponsive when searching file with very long lines
879859 - Assigned to Gentoo's Team for Core System packages
net-libs/gnutls: introduce USE=hardened with stronger defaults
880119 - Assigned to Gentoo's Team for Core System packages
sys-boot/syslinux-6.04_pre1-r3 - *** No rule to make target '/var/tmp/portage/sys-boot/syslinux-6.04_pre1-r3/work/syslinux-6.04-pre1/efi64/core/../codepage/cp865.cp', needed by 'codepage.cp'
881685 - Assigned to Gentoo's Team for Core System packages
dev-build/autoconf-2.71-r5: unexpected test failure "227: parallel autotest and signal handling"
882539 - Assigned to Gentoo's Team for Core System packages
app-shells/bash-4.4_p23-r2 fails to compile (CLANG-STRICTER-SYSTEM): string.h:478:14: error: expected identifier or (
883105 - Assigned to Gentoo's Team for Core System packages
sys-fs/multipath-tools: add proper USE=split-usr handling or move into /usr
883809 - Assigned to Gentoo's Team for Core System packages
sys-apps/nawk-20220122-r1 - awkgram.tab.c: error: redefinition of yylen
884561 - Assigned to Gentoo's Team for Core System packages
sys-process/numactl-2.0.16 fails test - cat: .../cpulist: No such file or directory
885489 - Assigned to Gentoo's Team for Core System packages
sys-libs/pam: proposal for new defaults for pam_limits
885589 - Assigned to Gentoo's Team for Core System packages
sys-apps/iproute2: Make colouring of 'ip' output by default optional
886187 - Assigned to Gentoo's Team for Core System packages
sys-libs/ncurses-6.3_p20221203 broken compilation with clang
886635 - Assigned to Gentoo's Team for Core System packages
sys-apps/sysvinit-3.06 - Error: msgmerge
887159 - Assigned to William Hubbs
sys-libs/ncurses - configure failure - error: cannot run C compiled programs
887753 - Assigned to Gentoo's Team for Core System packages
sys-block/gpart-0.3-r1 installs files into unexpected paths
888497 - Assigned to Gentoo's Team for Core System packages
dev-libs/libpcre2: fails to install on sparc ('find: ‘cksum’: File name too long' in multilib header check)
888659 - Assigned to Gentoo's Team for Core System packages
app-admin/sudo: cross-compilation to armv7a-unknown-linux-gnueabihf fails (Usage: install-sh [flags] source destination)
889434 - Assigned to Cross compilation support
sys-fs/quota-4.09 - file collision with net-mail/cyrus-imapd-3.4.4-r1
889563 - Assigned to Gentoo's Team for Core System packages
sys-apps/man-db-2.11.2 fails tests man-executable-page-on-path, man-language-specific-requests, man-missing-locales, man-so-links-same-section, and zsoelim-so-includes
890499 - Assigned to Gentoo's Team for Core System packages
net-firewall/iptables-1.8.9 fails tests: FAIL: xlate-test.py
890628 - Assigned to Gentoo's Team for Core System packages
sys-apps/minised-1.16 fails tests (DASH-SYSTEM): Running test 8bit-class run: 29: Bad substitution
890835 - Assigned to Embedded Gentoo Team
sys-apps/mlocate-0.26-r3 fails tests (DASH-SYSTEM)
890837 - Assigned to Gentoo's Team for Core System packages
net-libs/gnutls enable ktls and afalg
890923 - Assigned to Gentoo's Team for Core System packages
app-alternatives/sh: sh[ksh] should warn that local isn't supported
891019 - Assigned to Gentoo's Team for Core System packages
sys-process/numad-0.5_p20180531: segfault in bind_process_and_migrate_memory -> malloc
891033 - Assigned to Gentoo's Team for Core System packages
sys-fs/lvm2-2.03.17-r2: breakage with cached volumes when USE=lvm (-thin)
891821 - Assigned to Gentoo's Team for Core System packages
net-misc/dhcp: Build with large file support.
892237 - Assigned to Gentoo's Team for Core System packages
app-crypt/gnupg ships with expired certificate sks-keyservers.netCA.pem for obsolete SKS keyservers
892752 - Assigned to Gentoo's Team for Core System packages
sys-apps/debianutils: outdated LICENSE: BSD is not relevant
893532 - Assigned to Gentoo's Team for Core System packages
=sys-libs/ncurses-6.3_p20221203-r2[ada] build fail
893600 - Assigned to Gentoo's Team for Core System packages
sys-libs/zlib: build to work with automatic LFS checker
893656 - Assigned to Gentoo's Team for Core System packages
sys-apps/kexec-tools-2.0.24 fails to compile (LIBARCHIVE-SYSTEM): tar: Error exit delayed from previous errors
894168 - Assigned to Yuan Liao (Leo3418)
sys-apps/shadow should use capabilities instead of suid root for new{g,u}idmap binaries
894754 - Assigned to Gentoo's Team for Core System packages
sys-fs/e2fsprogs: Enable LFS
896340 - Assigned to Gentoo's Team for Core System packages
sys-apps/man-pages-6.04 calls commands that do not exist (MUSL-CLANG-SYSTEM): locale
898528 - Assigned to Gentoo's Team for Core System packages
sys-apps/netkit-base-0.17-r9 fails to compile (MUSL-CLANG-SYSTEM): mysleep.c:16:14: error: use of undeclared identifier NULL
898548 - Assigned to Gentoo's Team for Core System packages
sys-devel/gettext-0.22.5-r1 has implicit function declarations in configure logs (MUSL-CLANG-SYSTEM)
898570 - Assigned to Gentoo's Team for Core System packages
sys-apps/util-linux: trying to invoke bash completion on "su - -s" outputs "chsh --help"
899186 - Assigned to Gentoo's Team for Core System packages
app-admin/rasdaemon-0.8.0 - ras-events.c:(.text+<snip>): undefined reference to tep_filter_alloc
899220 - Assigned to Gentoo's Team for Core System packages
net-misc/openssh-9.9_p1 has implicit function declarations in configure logs (MUSL-CLANG-SYSTEM)
899908 - Assigned to Gentoo's Team for Core System packages
dev-libs/libgpg-error: Gaps in large file support
899954 - Assigned to Gentoo's Team for Core System packages
app-arch/gzip-1.13-r1 has implicit function declarations in configure logs (MUSL-CLANG-SYSTEM)
900118 - Assigned to Gentoo's Team for Core System packages
app-arch/sharutils-4.15.2-r2 has implicit function declarations in configure logs (GCC-13-SYSTEM)
900248 - Assigned to Gentoo's Team for Core System packages
app-alternatives/awk-4 does not manage /usr/share/man/man1/awk.1.bz2 symlink
900579 - Assigned to Gentoo's Team for Core System packages
dev-libs/libassuan: enable large file support
902473 - Assigned to Gentoo's Team for Core System packages
dev-libs/libgcrypt: enable large file support
902475 - Assigned to Gentoo's Team for Core System packages
dev-libs/libksba: enable large file support
902479 - Assigned to Gentoo's Team for Core System packages
net-misc/openssh: enable large file support
902901 - Assigned to Gentoo's Team for Core System packages
sys-boot/syslinux-6.04_pre1-r5 - nasm: No such file or directory
903199 - Assigned to Gentoo's Team for Core System packages
app-text/build-docbook-catalog clean up is ignoring ROOT=
903801 - Assigned to Gentoo's Team for Core System packages
app-shells/bash: add some $HISTCONTROL setting for interactive shells by default
903861 - Assigned to Gentoo's Team for Core System packages
sys-boot/grub: Grub fails to detect LVM volumes with: error: disk `lvmid/*/*' not found
904228 - Assigned to Mike Gilbert
sys-apps/qingy-1.0.0-r6 - rm: cannot remove .../qingy: No such file or directory
905183 - Assigned to Gentoo's Team for Core System packages
sys-auth/pambase: pam_limits don't get applied after login from tty when enforcing SELinux
905302 - Assigned to SE Linux Bugs
sys-apps/kexec-tools-2.0.24 - unpack: failure unpacking kexec-tools-2.0.24.tar.xz
906319 - Assigned to Yuan Liao (Leo3418)
sys-apps/smartmontools-7.3 fails to read nvme error log: Read 16 entries from Error Information Log failed: NVMe Status 0x13
906370 - Assigned to Gentoo's Team for Core System packages
dev-libs/libaio-0.3.113 fails tests (MUSL-SYSTEM): 23.t:75:17: error: unknown type name off64_t
906393 - Assigned to Gentoo's Team for Core System packages
dev-libs/libxslt-1.1.38 fails tests (MUSL-SYSTEM) (REC2 tests, Compare error at position 37)
906538 - Assigned to Sam James
app-admin/rasdaemon-0.8.0 - fetch fail
906558 - Assigned to Gentoo's Team for Core System packages
sys-libs/ncurses-compat-6.4_p20230401 has implicit function declarations in configure logs (MUSL-SYSTEM)
906880 - Assigned to Gentoo's Team for Core System packages
sys-fs/mdadm-4.2-r1 - restripe.c: error: off64_t undeclared (first use in this function)
907082 - Assigned to Gentoo musl team
net-libs/ntirpc-4.3 - /.../netconfig.h: error: expected ; before extern
907099 - Assigned to Gentoo musl team
sys-apps/nvme-cli-2.4-r2 fails to compile: meson.build:48:14: ERROR: Automatic wrap-based subproject downloading is disabled
907187 - Assigned to Gentoo's Team for Core System packages
>=sys-apps/coreutils-9.2-r2 cp: preserving permissions: Operation not supported when copying from no_root_squash nfs export
907710 - Assigned to Gentoo's Team for Core System packages
app-arch/gzip: zcat-reference/gunzip-reference not compatible with app-alternatives/gzip
907830 - Assigned to Gentoo's Team for Core System packages
net-misc/dhcp-4.4.3_p1-r6 has implicit function declarations in configure logs (MUSL-SYSTEM)
907878 - Assigned to Gentoo's Team for Core System packages
net-misc/netkit-fingerd-0.17-r3 fails to compile (MUSL-SYSTEM): util.c:231:5: error: unknown type name loff_t
907886 - Assigned to Gentoo's Team for Core System packages
dev-cpp/cppdap-0_pre20230605-r1 fails tests (MUSL-SYSTEM): environment: line 2174: 54599 Segmentation fault cppdap-unittests
908446 - Assigned to Gentoo's Team for Core System packages
sys-apps/nawk-20230909-r1 calls commands that do not exist (MUSL-SYSTEM): locale
908572 - Assigned to Gentoo's Team for Core System packages
sys-process/psmisc-23.6 fails tests (MUSL-SYSTEM)
908672 - Assigned to Gentoo's Team for Core System packages
sys-libs/zlib-ng-2.1.2-r1 adds -Werror flag on its own (MUSL-SYSTEM)
908677 - Assigned to Gentoo's Team for Core System packages
dev-debug/strace-6.3: build failure error: 'const struct io_sqring_offsets' has no member named 'resv2'
908910 - Assigned to Gentoo's Team for Core System packages
dev-libs/openssl-3.0.9: fails 70-test_sslmessages.t test on sparc
909019 - Assigned to Gentoo's Team for Core System packages
sys-fs/lvm2: Add option to not compile lvmpolld
909418 - Assigned to Gentoo's Team for Core System packages
net-misc/openssh-9.3_p1-r1 - unclear message about -sctp
909733 - Assigned to Gentoo's Team for Core System packages
dev-libs/openssl-3.0.9-r1: crossdev: mipsel-unknown-linux-gnu-gcc: error: unrecognized command-line option ‘-m64’
909746 - Assigned to Gentoo's Team for Core System packages
sys-apps/util-linux-2.39.1[nls] does not install translated man pages
910103 - Assigned to Gentoo's Team for Core System packages
dev-build/cmake-3.26.4-r1 - add USE=zstd and compile against it
910392 - Assigned to Gentoo's Team for Core System packages
sys-libs/libnvme-1.5 fails to compile with dev-lang/python-exec[-native-symlinks]
910596 - Assigned to Gentoo's Team for Core System packages
net-misc/openssh-9.3 - ssh_config - SendEnv instructions in gentoo config overwrites user and admin config
910701 - Assigned to Gentoo's Team for Core System packages
net-misc/wget-1.21.4 fails test - FAIL: Test-auth-basic.px
911153 - Assigned to Gentoo's Team for Core System packages
net-misc/iputils-20221126-r1: rarpd removed on upgrade
911228 - Assigned to Gentoo's Team for Core System packages
sys-apps/util-linux-9999: File collisions with sys-apps/shadow
911339 - Assigned to Gentoo's Team for Core System packages
app-misc/ca-certificates wrong license
911654 - Assigned to Gentoo's Team for Core System packages
net-libs/gnutls-3.8.1-r1 calls commands that do not exist: 2006-09-23 00:00:00
911833 - Assigned to Gentoo's Team for Core System packages
sys-apps/coreutils-9.3-r3 fails test - FAIL: tests/misc/cut-huge-range.sh
911875 - Assigned to Gentoo's Team for Core System packages
dev-libs/libassuan wrong license
911919 - Assigned to Gentoo's Team for Core System packages
dev-libs/libgpg-error wrong license
911971 - Assigned to Gentoo's Team for Core System packages
dev-libs/libpipeline wrong license
912069 - Assigned to Gentoo's Team for Core System packages
dev-libs/libusb wrong license
912267 - Assigned to Gentoo's Team for Core System packages
dev-util/pkgconf maybe missing license
912395 - Assigned to Gentoo's Team for Core System packages
net-firewall/iptables missing license
912409 - Assigned to Gentoo's Team for Core System packages
net-libs/gnutls wrong license
912411 - Assigned to Gentoo's Team for Core System packages
sys-apps/util-linux-2.39.2 installs pkg-config files with mismatched Version
912426 - Assigned to Gentoo's Team for Core System packages
sys-fs/lufs-0.9.7-r4 - ftplib.cpp: error: assigning to int from
912439 - Assigned to Gentoo's Team for Core System packages
net-misc/openssh missing/wrong license
912726 - Assigned to Gentoo's Team for Core System packages
net-misc/pps-tools wrong license
912727 - Assigned to Gentoo's Team for Core System packages
sys-apps/debianutils wrong license
912739 - Assigned to Gentoo's Team for Core System packages
sys-apps/diffutils wrong license
912804 - Assigned to Gentoo's Team for Core System packages
sys-apps/findutils missing license
912806 - Assigned to Gentoo's Team for Core System packages
sys-apps/grep missing license
912809 - Assigned to Gentoo's Team for Core System packages
sys-apps/groff wrong license
912813 - Assigned to Gentoo's Team for Core System packages
sys-apps/iproute2 missing license
912832 - Assigned to Gentoo's Team for Core System packages
sys-apps/man-db wrong license
912856 - Assigned to Gentoo's Team for Core System packages
sys-apps/man-pages wrong license
912859 - Assigned to Gentoo's Team for Core System packages
sys-apps/net-tools missing license
912860 - Assigned to Gentoo's Team for Core System packages
sys-apps/sed missing license
912867 - Assigned to Gentoo's Team for Core System packages
sys-apps/shadow missing/wrong license
912868 - Assigned to Gentoo's Team for Core System packages
sys-apps/sysvinit missing license
912869 - Assigned to William Hubbs
sys-apps/texinfo missing license
912870 - Assigned to Gentoo's Team for Core System packages
sys-apps/usbutils missing license
912871 - Assigned to Gentoo's Team for Core System packages
sys-apps/which wrong license
912873 - Assigned to Gentoo's Team for Core System packages
dev-build/autoconf missing license
912940 - Assigned to Gentoo's Team for Core System packages
dev-build/autoconf-archive wrong/missing license
912945 - Assigned to Gentoo's Team for Core System packages
sys-devel/bison missing license
912951 - Assigned to Gentoo's Team for Core System packages
sys-devel/flex ancient license text
912953 - Assigned to Gentoo's Team for Core System packages
sys-devel/gettext license not depended on use-flag
912957 - Assigned to Gentoo's Team for Core System packages
dev-build/make missing license
912963 - Assigned to Gentoo's Team for Core System packages
sys-fs/cryptsetup missing license
912964 - Assigned to Gentoo's Team for Core System packages
sys-fs/e2fsprogs missing license
912965 - Assigned to Gentoo's Team for Core System packages
app-arch/rpm2targz: maybe use app-alternatives/cpio in RDEPEND?
913148 - Assigned to Gentoo's Team for Core System packages
sys-apps/dnotify-0.18.0-r1 has implicit function declarations in configure logs (PYTHON-3.12-SYSTEM)
913366 - Assigned to Gentoo's Team for Core System packages
app-admin/sudo-1.9.14_p3 - [slibtool] exec_intercept.c:(.text+<snip>): undefined reference to intercept_response_get_packed_size
913678 - Assigned to Gentoo's Team for Core System packages
dev-libs/openssl-compat-1.0.2u-r2 fails to build with llvm 17 due to version script assignment
914283 - Assigned to Gentoo's Team for Core System packages
net-misc/wget-1.21.4 fails test - FAIL: Test-metalink-http.py
914880 - Assigned to Gentoo's Team for Core System packages
dev-build/cmake: Missing dependency on net-libs/nghttp2
916592 - Assigned to Gentoo's Team for Core System packages
sys-libs/zlib-1.2.13-r2 fails in fetch stage
916675 - Assigned to Gentoo's Team for Core System packages
net-misc/dhcpcd-10.0.3: starting dhcpcd blanks the /etc/ntp.conf provided by gentoo
916776 - Assigned to William Hubbs
sys-fs/dd-rescue tries to use git during emerge
917511 - Assigned to Gentoo's Team for Core System packages
net-firewall/ipset-7.21 - [clang] ld.lld: error: version script assignment of LIBIPSET_1.0 to symbol ipset_parse_name failed: symbol not defined
918913 - Assigned to Gentoo's Team for Core System packages
net-misc/jwhois - unmaintained and broken
919809 - Assigned to Gentoo's Team for Core System packages
sys-apps/sysvinit: Add local description for USE=ibm
920195 - Assigned to William Hubbs
sys-apps/kexec-tools-2.0.22 - unpack: failure unpacking kexec-tools-2.0.22.tar.xz
920333 - Assigned to Yuan Liao (Leo3418)
app-shells/bash-3.0_p22 fails to compile (GCC-14-SYSTEM): bashversion.c:138:21: error: implicit declaration of function [-Wimplicit-function-declaration]
920521 - Assigned to Gentoo's Team for Core System packages
dev-debug/strace Fails on m68k xlat/pollflags.h:75:1: error: static assertion failed: "POLLWRBAND != 0x0100"
920815 - Assigned to Gentoo's Team for Core System packages
sys-apps/util-linux-2.39.2-r1 fails tests on arm
920908 - Assigned to Gentoo's Team for Core System packages
sys-boot/syslinux-6.04_pre3-r1 fails to build against sys-boot/gnu-efi-3.0.17 /usr/include/efi/x86_64/efibind.h:101:9: error: unknown type name ‘wchar_t’
921597 - Assigned to Gentoo's Team for Core System packages
sys-fs/f2fs-tools has an implicit dependency on libsparse
921837 - Assigned to Gentoo's Team for Core System packages
sys-libs/ncurses: Make threaded libraries optional
922254 - Assigned to Gentoo's Team for Core System packages
sys-apps/coreutils-9.4 fails test reflink-auto
922313 - Assigned to Gentoo's Team for Core System packages
sys-apps/shadow: useradd fails to create user with -Z
922538 - Assigned to SE Linux Bugs
sys-boot/syslinux-6.04_pre1-r5 - /.../cfgtype.c: warning: conflicting types for pci_set_config_type due to enum/integer mismatch; have int(enum pci_co
922596 - Assigned to Gentoo's Team for Core System packages
dev-build/autoconf-vanilla-2.13 fails tests (MUSL-SYSTEM)
922674 - Assigned to Gentoo's Team for Core System packages
dev-build/autoconf-vanilla-2.71 fails tests (MUSL-SYSTEM)
922675 - Assigned to Gentoo's Team for Core System packages
dev-libs/libpipeline-1.5.7 fails tests (MUSL-SYSTEM)
922759 - Assigned to Gentoo's Team for Core System packages
app-arch/tar-1.35 fails tests if not run sequentially
922896 - Assigned to Gentoo's Team for Core System packages
sys-apps/kexec-tools: system reboots in a broken state due to uninitialized modules
922909 - Assigned to Yuan Liao (Leo3418)
sys-apps/util-linux: Add minix USE flag
923306 - Assigned to Gentoo's Team for Core System packages
app-misc/ca-certificates ebuild can't apply patch to blacklist some certs from mozilla
923756 - Assigned to Gentoo's Team for Core System packages
app-crypt/hashalot-0.3-r2 - file collision with dev-haskell/sha-1.6.4.4
923782 - Assigned to Gentoo's Team for Core System packages
sys-apps/attr-2.5.2 fails tests: FAIL: attr.test
923892 - Assigned to Gentoo's Team for Core System packages
sys-fs/cryptsetup-2.6.1 calls commands that do not exist: PKGMODULES+= openssl:
923923 - Assigned to Gentoo's Team for Core System packages
sys-apps/groff-1.23.0 calls commands that do not exist: make LIBTOOL=rlibtool
923943 - Assigned to Gentoo's Team for Core System packages
app-arch/gzip-1.13-r1 installs files that contain a TEXTREL
924202 - Assigned to Gentoo's Team for Core System packages
sys-devel/gettext-0.22.4 does not respect LDFLAGS
924230 - Assigned to Gentoo's Team for Core System packages
sys-libs/ncurses-compat-6.4_p20230401 fails to compile: configure: error: getopt is required for building programs
924484 - Assigned to Gentoo's Team for Core System packages
app-arch/gzip runtime issue and failed test when compiled with sys-libs/fortify-headers enablled - cmp: EOF on - after byte 32768, in line 887
924722 - Assigned to Gentoo's Team for Core System packages
sys-devel/bison: Add --without-libtextstyle option
925100 - Assigned to Gentoo's Team for Core System packages
sys-libs/pam: pam_lastlog is not present on musl systems
925222 - Assigned to Gentoo's Team for Core System packages
sys-fs/xfsprogs-6.8.0 has implicit function declarations in configure logs
925233 - Assigned to Gentoo's Team for Core System packages
sys-fs/xfsdump-3.1.12 fails to compile: content_inode.h:30:9: error: unknown type name off64_t
925234 - Assigned to Gentoo's Team for Core System packages
sys-apps/util-linux-2.39.4 problems with installed bash completions
925362 - Assigned to Gentoo's Team for Core System packages
sys-libs/libnvme-1.8 fails tests: sysfs TIMEOUT 30.05s killed by signal 15 SIGTERM
925510 - Assigned to Gentoo's Team for Core System packages
sys-apps/texinfo-7.1-r1 does not install texinfo.tex
925761 - Assigned to Gentoo's Team for Core System packages
net-libs/ntirpc-5.0 fails to compile: ld.lld: error: version script assignment of NTIRPC_5.0 to symbol _authenticate failed: symbol not defined
926132 - Assigned to Gentoo's Team for Core System packages
app-crypt/gnupg-2.4.4-r1 fails tests with USE=tpm
926152 - Assigned to Gentoo's Team for Core System packages
app-crypt/gnupg-2.4.4-r1 generates keys incompatible with other PGP implementations
926186 - Assigned to Gentoo's Team for Core System packages
sys-process/numactl-2.0.18 fails test - ./../test/checktopology numactl --hardware cpus look bogus
926363 - Assigned to Gentoo's Team for Core System packages
dev-build/libtool-2.4.7-r2 fails test - [slibtool] ERROR: 148 tests were run,
926365 - Assigned to Gentoo's Team for Core System packages
sys-apps/man-db man ffmpeg doesn't work and other mans also have the same error (musl)
926414 - Assigned to Gentoo's Team for Core System packages
sys-apps/gawk-5.3.0-r1 fails test - Make check failed. See above for details.
926667 - Assigned to Gentoo's Team for Core System packages
sys-boot/grub-2.12-r2: grub-mkconfig generates a config listing old kernels before just installed ones
926690 - Assigned to Mike Gilbert
sys-apps/keyutils-1.6.3-r1 test fails when ABI_X86='32 64'
926955 - Assigned to Robin Johnson
sys-fs/dd-rescue-1.99.13-r1 fails to compile: dd_rescue.c:(.text+0x704): undefined reference to find_nonzero_arm6
927008 - Assigned to Gentoo's Team for Core System packages
sys-libs/pwdb-0.62-r2 fails to compile: make: armv7a-unknown-linux-gnueabihf-armv7a-unknown-linux-gnueabihf-gcc: No such file or directory
927009 - Assigned to Gentoo's Team for Core System packages
sys-apps/coreutils-9.4-r1 fails test - FAIL: tests/du/long-sloop.sh
927454 - Assigned to Gentoo's Team for Core System packages
sys-libs/db-5.3.28-r9 fails to build with clang
927469 - Assigned to Gentoo's Team for Core System packages
app-arch/rpm2targz: user and group in resulting tarball are the current user, rather than root
927560 - Assigned to Gentoo's Team for Core System packages
sys-apps/pcsc-lite-2.0.1 missing device rules
927656 - Assigned to Gentoo's Team for Core System packages
net-firewall/nftables: support loading config file from /etc
927744 - Assigned to Gentoo's Team for Core System packages
sys-boot/grub-2.12-r2 fails to build on x32 (grub/efi/api.h:1117:3: error: X32 does not support ‘ms_abi’ attribute)
927826 - Assigned to Mike Gilbert
sys-apps/dnotify-0.18.0-r1 has implicit function declarations in configure logs
927875 - Assigned to Gentoo's Team for Core System packages
sys-apps/baselayout: Some games are crashing linked to a vm_max_map_count too low
927896 - Assigned to William Hubbs
sys-apps/coreutils-9.4-r1 fails test - locale: Cannot set LC_CTYPE to default locale: No such file or directory
927916 - Assigned to Gentoo's Team for Core System packages
sys-fs/autorun-3.17 has implicit function declarations in configure logs
927940 - Assigned to Gentoo's Team for Core System packages
sys-apps/gawk-5.3.0-r1: fails when trying to install files to /usr/lib/modules even with no files for that path
928337 - Assigned to Gentoo's Team for Core System packages
sys-power/athcool-0.3.12 fails to compile: test.c:(.text.startup+0x31): undefined reference to pacc
928413 - Assigned to Gentoo's Team for Core System packages
sys-libs/db-6.0.35-r5 - /.../atomic.h: error: too few arguments provided to function-like macro invocation
928488 - Assigned to Gentoo's Team for Core System packages
net-fs/nfs-utils: Service files explicitly depend on nfsv3's nfs-server.service
928526 - Assigned to Gentoo's Team for Core System packages
sys-apps/fakeroot multilib support
929051 - Assigned to Gentoo's Team for Core System packages
sys-fs/f2fs-tools-1.16.0-r1 - [slibtool] error: unable to find library -lf2fs
929070 - Assigned to Gentoo's Team for Core System packages
app-alternatives/gzip-1 missing zgrep
929978 - Assigned to Gentoo's Team for Core System packages
sys-libs/ncurses-6.4_p20240414 fails to compile: configure: error: getopt is required for building programs
930240 - Assigned to Gentoo's Team for Core System packages
dev-libs/openssl:3.2.1-r2: unrecognized opcode: Error: unrecognized opcode: `stvx'
930260 - Assigned to Gentoo's Team for Core System packages
sys-apps/coreutils-9.5 fails test - FAIL: tests/touch/not-owner.sh
930361 - Assigned to Gentoo's Team for Core System packages
sys-libs/minizip-ng: `unzGetCurrentFileZStreamPos64` is not provided
930365 - Assigned to Chromium Project
net-misc/openssh-9.6_p1-r3 fails tests with FEATURES="-userpriv": AllowUsers/DenyUsers
930493 - Assigned to Gentoo's Team for Core System packages
sys-block/parted: fails test with USE="-nls" - FAIL: t0251-gpt-unicode.sh
930799 - Assigned to Michał Górny
sys-libs/pam: wire up econf support
931117 - Assigned to Gentoo's Team for Core System packages
sys-apps/util-linux: wire up econf support
931118 - Assigned to Gentoo's Team for Core System packages
sys-apps/shadow: get logind support working for elogind too
931119 - Assigned to Gentoo's Team for Core System packages
sys-apps/util-linux: wire up liblastlog2/pam_lastlog2 for y2038 support
931297 - Assigned to Gentoo's Team for Core System packages
sys-apps/util-linux-2.40.1 - /.../ld: cannot find ./.../libmount.so: No such file or directory
931323 - Assigned to Gentoo's Team for Core System packages
net-misc/dhcpcd-10.5.0 has implicit function declarations in configure logs
932828 - Assigned to William Hubbs
sys-apps/sed-4.9-r1 has implicit function declarations in configure logs
932829 - Assigned to Gentoo's Team for Core System packages
dev-libs/libaio-0.3.113-r1 fails tests on hppa, sparc
933092 - Assigned to Gentoo's Team for Core System packages
app-arch/xz-utils-5.6.2 and previous version fails to build with sys-devel/gcc:13 but builds with sys-devel/gcc:11 (../../src/liblzma/.libs/liblzma.so: undefined reference to `__pthread_cond_timedwait64')
933282 - Assigned to Gentoo's Team for Core System packages
sys-libs/ncurses-6.4_p20240414 with x11-terms/xterm-390: Inconsistent defaults for backspace key
933302 - Assigned to Gentoo's Team for Core System packages
app-arch/xz-utils-5.6.2 - [llvm] ld.lld: error: cannot open .../libclang_rt.profile-i386.a: No such file or directory
933350 - Assigned to Gentoo's Team for Core System packages
dev-util/pkgconf-2.2.0 possible race condition in tests
933430 - Assigned to Gentoo's Team for Core System packages
sys-apps/man-db generated database is missing man pages located in non-standard paths (e.g. sys-devel/gcc man pages)
933757 - Assigned to Gentoo's Team for Core System packages
app-editors/nano add support for a /etc/nanorc.d/ directory
933989 - Assigned to Gentoo's Team for Core System packages
app-crypt/gpgme-1.23.2: tests (try to) use sys-apps/which
934067 - Assigned to Gentoo's Team for Core System packages
sys-apps/iproute2-6.9.0 - [perl-5.40] [icu-75.1] arpd.c: error: initialization of int from void makes integer from pointer without a cast [-Wint-conversion]
934119 - Assigned to Gentoo musl team
sys-fs/e2fsprogs-1.47.4[fuse] calls commands that do not exist: fuse3_CFLAGS - C - fuse3_LIBS
934145 - Assigned to Gentoo's Team for Core System packages
app-shells/bash-5.1_p16-r10 10-gentoo-title.bash fails to set the window title with ssh session
934309 - Assigned to Gentoo's Team for Core System packages
app-arch/xz-utils-5.6.2-r1[pgo] - In function 'hc_find_func': .../work/xz-5.6.2/src/liblzma/lz/lz_encoder_mf.c:743:1: error: corrupted profile info: profile data is not flow-consistent
934590 - Assigned to Gentoo's Team for Core System packages
app-crypt/gnupg: /usr/lib64/libassuan.so.9: version `LIBASSUAN_2.0' not found after updating dev-libs/libassuan to 3.x series
935028 - Assigned to Gentoo's Team for Core System packages
sys-apps/less-661, lesspipe coloring: Very hard to read: Make style configurable & document it
935703 - Assigned to Gentoo's Team for Core System packages
app-shells/bash-5.2_p26-r8 - [perl-5.40] [icu-75.1] /.../sh:line <snip>: cd: doc: No such file or directory
935711 - Assigned to Gentoo's Team for Core System packages
net-fs/nfs-utils: CONFIG_NFSD_LEGACY_CLIENT_TRACKING is deprecated and nfsdcld has no OpenRC support
935724 - Assigned to Gentoo's Team for Core System packages
>=sys-apps/less-643 using dev-python/pygments-2.17.2: slow coloring
935729 - Assigned to Gentoo's Team for Core System packages
net-misc/openssh sets permission 0600 for sshd_config
936038 - Assigned to Gentoo's Team for Core System packages
app-crypt/pinentry: Use opensuse/fedora wrapper to try to use the right pinentry implementation at runtime
936206 - Assigned to Gentoo's Team for Core System packages
dev-build/meson: bug with linker detection? (media-sound/mpd-0.23.13-r1 hates all linkers)
936253 - Assigned to Gentoo's Team for Core System packages
net-misc/openssh-9.7_p1-r6 USE=pam allows "PasswordAuthentication" despite disabled
936483 - Assigned to Gentoo's Team for Core System packages
sys-apps/coreutils-9.5 (llvm-musl) error: undefined symbol: __truncsfbf2
936645 - Assigned to Gentoo's Team for Core System packages
net-nds/gssproxy-0.9.2 fails to compile: gss_proxy_xdr.c:28:35: error: passing argument 2 of gp_xdr_uint64_t from incompatible pointer type [-Wincompatible-pointer-types]
937097 - Assigned to Gentoo's Team for Core System packages
sys-apps/iproute2-6.8.0-r2: call to undeclared function 'yyparse' [-Wimplicit-function-declaration] on musl/llvm
937344 - Assigned to Gentoo's Team for Core System packages
sys-fs/xfsprogs-6.8.0 fails to build on alpha (qemu-based iso build), ‘MADV_SOFT_OFFLINE’ undeclared
937838 - Assigned to Gentoo's Team for Core System packages
dev-libs/libbsd-0.11.8: nlist test fails with mold
937917 - Assigned to Gentoo's Team for Core System packages
sys-libs/libcap-2.70: fails libcapsotest test with mold
937920 - Assigned to Gentoo's Team for Core System packages
sys-libs/ncurses-6.5_p20240615 - [ncurses-6.5] [gcc-15] (.text+<snip>): undefined reference to main
938013 - Assigned to Gentoo's Team for Core System packages
sys-fs/quotatool-1.6.5 - ./.../linux_quota.h: fatal error: sys/cdefs.h: No such file or directory
938084 - Assigned to Gentoo musl team
dev-build/meson-1.5.1 test fail: frameworks: 15 llvm
938126 - Assigned to Gentoo's Team for Core System packages
dev-build/meson-1.5.1 fails tests LinuxlikeTests::test_identity_cross etc.
938178 - Assigned to Gentoo's Team for Core System packages
sys-apps/keyutils-1.6.3-r1 fails tests on ppc
939005 - Assigned to Robin Johnson
dev-build/meson-1.5.1 fails test - [ncurses-6.5] [gcc-15] ERROR: test_qtdependency_pkgconfig_detection (unittests.linuxliketests.LinuxlikeTests.test_qtdependency_pkgconfig_d
939136 - Assigned to Gentoo's Team for Core System packages
app-admin/sudo: PATH values from profile.env may be ignored in merge-usr
939157 - Assigned to Gentoo's Team for Core System packages
app-admin/sudo: Consider alternative secure_path order
939158 - Assigned to Gentoo's Team for Core System packages
sys-fs/progsreiserfs-0.3.1_rc8-r1 - [gcc-15] [slibtool] /.../ld: ../.../libintl.a(dcigettext.o): relocation R_X86_64_PC32 against symbol _nl_current_default_domain_ can n
939326 - Assigned to Gentoo musl team
sys-fs/f2fs-tools-1.16.0-r1 - [gcc-15] [slibtool] /.../ld: cannot find -lf2fs: No such file or directory
939432 - Assigned to Gentoo's Team for Core System packages
sys-block/parted-3.6-r2 fails test - [ncurses-6.5] [meson-9999] [gcc-15] FAIL: t3310-flags.sh
939605 - Assigned to Michał Górny
dev-util/pkgconf-2.2.0: not using more modules from [list of modules]
939814 - Assigned to Gentoo's Team for Core System packages
dev-libs/openssl-compat-1.0.2u-r2 - [gcc-15] collect2: error: ld returned 1 exit status
939861 - Assigned to Gentoo's Team for Core System packages
sys-apps/shadow-4.14.8 requires glibc >= 2.38 according to configure output, but not in ebuild
940354 - Assigned to Gentoo's Team for Core System packages
sys-apps/minised-1.16 - [ncurses-6.5] [meson] [libtool] [gcc-15] sedexec.c: error: type of last_line_used does not match original declaration [-Werror=lto-type-mismatch]
940492 - Assigned to Embedded Gentoo Team
app-crypt/pinentry-1.3.1[verify-sig]: emerge fails with "Fetched file: pinentry-1.3.1.tar.bz2.sig VERIFY FAILED!"
941142 - Assigned to Gentoo's Team for Core System packages
net-misc/openssh sshd with systemd socket activation errors out with: ssh_dispatch_run_fatal: Connection from IPADDRHERE port 33390: Bad file descriptor [preauth]
941251 - Assigned to Gentoo's Team for Core System packages
dev-lang/yasm: invalid dependency on dev-lang/python (in unused -9999 code)
941433 - Assigned to Gentoo's Team for Core System packages
dev-build/meson-1.5.2 fails test - [libtool] [gcc-15] [ERROR] linuxlike: 13 cmake dependency
941492 - Assigned to Gentoo's Team for Core System packages
sys-fs/extundelete: build log isn't verbose
941927 - Assigned to Gentoo's Team for Core System packages
sys-apps/watchdog-5.16-r1: unable to set realtime priority
941976 - Assigned to Gentoo's Team for Core System packages
sys-boot/grub: cannot boot UKIs with secureboot enabled (via shim) and missing support for multi-profile UKIs
942201 - Assigned to Mike Gilbert
sys-apps/qingy-1.0.0-r6 installs binaries linked to libcrypt.so without depend on virtual/libcrypt
942383 - Assigned to Gentoo's Team for Core System packages
app-arch/ncompress-5.0-r1 fails tests
942389 - Assigned to Gentoo's Team for Core System packages
sys-apps/nvme-cli-2.11 - [gcc-15] ../.../nvme-print.c: error: LC_MEASUREMENT undeclared (first use in this function)
942668 - Assigned to Gentoo musl team
sys-libs/zlib-1.3.1 : Unresolved soname dependencies - PIC
942820 - Assigned to The Gentoo Linux Hardened Team
sys-fs/cryptsetup-2.7.5: dmcrypt asks confirmation for recreating LUKS partition on isLuks error on startup
942821 - Assigned to Gentoo's Team for Core System packages
sys-boot/grub-2.12-r5 with clang and musl/llvm profile: error: invalid argument '-mcmodel=large' only allowed with '-fno-pic'
942843 - Assigned to Mike Gilbert
sys-libs/ncurses-6.4_p20240414 fails to compile: cursespad.cc:197:6: error: default argument given for parameter 2 of void NCursesPad::setWindow(NCursesWindow&, int, int)
942857 - Assigned to Gentoo's Team for Core System packages
dev-libs/openssl: Please add use flags to enable compression algorithms
943254 - Assigned to Gentoo's Team for Core System packages
sys-apps/baselayout: Include sysctl defaults
943524 - Assigned to William Hubbs
app-arch/xz-utils-5.6.3 has implicit function declarations in configure logs
943553 - Assigned to Gentoo's Team for Core System packages
sys-apps/util-linux: Add USE flag to allow More not to be installed
944023 - Assigned to Gentoo's Team for Core System packages
sys-apps/less: Add USE flag and install symlink to more
944024 - Assigned to Gentoo's Team for Core System packages
sys-block/thin-provisioning-tools-1.1.0-r2: fails to compile on musl due to rust dynamically loading libclang
944417 - Assigned to Gentoo's Team for Core System packages
sys-apps/ifplugd-0.28-r12 installs the same files with USE=doc
944466 - Assigned to Gentoo's Team for Core System packages
app-arch/xz-utils-5.6.3[pgo] - In function 'dict_repeat': .../src/liblzma/lz/lz_decoder.h:182:17: error: corrupted value profile: stringops profile counter (1128129 out of 4701978) inconsistent with basic-block count (4797008)
945161 - Assigned to Gentoo's Team for Core System packages
net-firewall/nftables-1.1.1 fails to compile: if_ether.h:119:1: error: redefinition of struct or union struct ethhdr
945470 - Assigned to Gentoo's Team for Core System packages
dev-build/cmake: aborts with "std::bad_alloc" when configuring dev-qt/qtbase-6.8.1 if(?) built with clang on aarch64 and lto? (exact cause unknown)
945838 - Assigned to Gentoo's Team for Core System packages
sys-auth/sssd-2.9.6 fails tests
945960 - Assigned to Gentoo's Team for Core System packages
sys-auth/sssd-2.9.6 installs deprecated .egg/.egg-info
945963 - Assigned to Gentoo's Team for Core System packages
net-firewall/iptables-1.8.11: fails to build with musl (error: redefinition of 'ethhdr')
946073 - Assigned to Gentoo's Team for Core System packages
sys-apps/coreutils: install segfault during configure
946549 - Assigned to Gentoo's Team for Core System packages
net-misc/openssh-9.9_p1[-ssl], net-misc/openssh-contrib-9.7_p1-r4[-ssl] installs broken config file
946852 - Assigned to Gentoo's Team for Core System packages
app-crypt/gnupg-2.4.7 fails tests (testsunimportable.scm testslongpassphrase.scm testsecc.scm testsrsa.scm testsunimportable.scm testslongpassphras) with app-crypt/swtpm installed (sometimes?)
946973 - Assigned to Gentoo's Team for Core System packages
dev-build/cmake sci-libs/hdf5: version string format mismatch
947172 - Assigned to Gentoo Science Related Packages
sys-fs/cryptsetup Service does not wait on sources without "="
947201 - Assigned to Gentoo's Team for Core System packages
sys-fs/lvm2: init script should honor autoactivation flag
947218 - Assigned to Gentoo's Team for Core System packages
sys-fs/lvm2-2.03.22-r7 lvcreate fails to create second mirrored volume in a row
947263 - Assigned to Gentoo's Team for Core System packages
sys-fs/lvm2-2.03.22-r7: installs udev rule that causes cryptsetup stuck on systems without systemd
947314 - Assigned to Gentoo's Team for Core System packages
dev-libs/libgcrypt-1.11.0-r1 fails to build on POWER8 with USE=asm
947497 - Assigned to Gentoo's Team for Core System packages
sys-apps/utempter-0.5.5.6-r2 fails to compile: utempter.c:162:18: error: passing argument 1 of gettimeofday from incompatible pointer type [-Wincompatible-pointer-types]
948224 - Assigned to Gentoo's Team for Core System packages
dev-build/meson-1.1.1: old version fails tests
948612 - Assigned to Gentoo's Team for Core System packages
sys-fs/mdadm mdraid rc script susceptible to race condition because it doesn't depend on udev-settle
948846 - Assigned to Gentoo's Team for Core System packages
app-arch/xz-utils-5.6.4 does not install small documentation files in /usr/share/doc
948848 - Assigned to Gentoo's Team for Core System packages
sys-apps/file-5.46-r2 classifies some cpio as unified diff
948921 - Assigned to Gentoo's Team for Core System packages
sys-fs/ntfs3g: ntfsdecrypt can't handle certificate file
949096 - Assigned to Patrick McLean
app-arch/sharutils-4.15.2-r3[-nls]: unshar.c:442:3: error: implicit declaration of function 'bindtextdomain'
949267 - Assigned to Gentoo's Team for Core System packages
dev-build/meson-1.7.0: failure on csharp tests
949344 - Assigned to Gentoo's Team for Core System packages
net-libs/rpc2: tree clean request
949350 - Assigned to Gentoo's Team for Core System packages
dev-build/meson-1.7.0 fails test - [texlive] [gcc-15] ERROR: test_qt6dependency_qmake_detection (unittests.linuxliketests.LinuxlikeTests.test_qt6dependency_qmake_detectio
949797 - Assigned to Gentoo's Team for Core System packages
sys-apps/coreutils-9.6 fails test - [meson] [gcc-15] [ffmpeg] FAIL: tests/.../no-allocate.sh
949798 - Assigned to Gentoo's Team for Core System packages
net-misc/openssh: add ssh-agent systemd user service
949951 - Assigned to Gentoo's Team for Core System packages
net-misc/openssh-9.9_p2: Warnings with mold - mold: warning: unknown command line option: -z retpolineplt
949955 - Assigned to Gentoo's Team for Core System packages
sys-libs/pam-1.6.1: "unix_chkpwd[1575]: check pass; user unknown" when using mate-extra/mate-screensaver-1.28.0 or kde-plasma/kscreenlocker-6.2.5
950022 - Assigned to immolo
sys-libs/pam-1.7.0_p20241230-r3 FAILED doc/sag/Linux-PAM_SAG.pdf doc/adg/Linux-PAM_ADG.pdf
950288 - Assigned to Gentoo's Team for Core System packages
dev-build/automake-1.17-r1 fails test t/dist-formats.tap 47 - ac=dist-zip,no-dist-gzip [distcheck]
950303 - Assigned to Gentoo's Team for Core System packages
dev-build/meson-1.7.0 fails test - [gcc-15] [ERROR] java: 1 basic
950327 - Assigned to Gentoo's Team for Core System packages
dev-libs/openssl-3.4.1: Fails to build with slibtool - /bin/sh: line 1: make LIBTOOL=rlibtool: command not found
951457 - Assigned to Gentoo's Team for Core System packages
dev-build/cmake-3.31.6-r1 fails test - [gcc-15] 254 - JavaExportImport (Failed)
951508 - Assigned to Gentoo's Team for Core System packages
dev-build/meson: wrongly detects linker as bfd with llvm-core/clang and -fuse-ld=lld in *FLAGS
951712 - Assigned to Gentoo's Team for Core System packages
dev-build/automake-1.17-r1 test failure: t/dist-missing-am.sh (hardened desktop plasma)
952066 - Assigned to Gentoo's Team for Core System packages
dev-libs/openssl-3.4.1 errors with MinProtocol = TLSv1.0 in openssl.cnf
952101 - Assigned to Gentoo's Team for Core System packages
sys-apps/x86info: needs porting to Python 3.13
952721 - Assigned to Robin Johnson
dev-cpp/cppdap-0_pre20240802[+test] - ld: libcppdap.so: undefined reference to `__atomic_fetch_sub_8'
952817 - Assigned to Gentoo's Team for Core System packages
sys-boot/grub-2.12 GRUB fails to boot on IBM Power 720 server
952852 - Assigned to Mike Gilbert
dev-util/pkgconf: missing GPL-2+-with-autoconf-exception license for pkg.m4
952918 - Assigned to Gentoo's Team for Core System packages
<=app-shells/bash:4.4 - can’t build with gcc-14 [-Wimplicit-int] [-Wimplicit-function-declaration]
952956 - Assigned to Gentoo's Team for Core System packages
sys-boot/syslinux-6.04_pre3-r1 - efi/main.c:189:13: error: passing argument 1 of ‘longjmp’ from incompatible pointer type [-Wincompatible-pointer-types]
953346 - Assigned to Gentoo's Team for Core System packages
sys-fs/lufs-0.9.7-r4 - [llvm] ftplib.cpp: error: assigning to int from incompatible type _bind<int &, sockaddr , unsigned long>
953371 - Assigned to Gentoo's Team for Core System packages
net-misc/openssh with net-misc/putty-0.81 failed putty transfer data
953482 - Assigned to Gentoo's Team for Core System packages
dev-build/meson-1.7.2 fails test - [meson] [gcc-15] mpi tests timeout
953531 - Assigned to Gentoo's Team for Core System packages
net-libs/ntirpc-6.0.1 - [cmake-4] -- Configuring incomplete, errors occurred!
953763 - Assigned to Gentoo's Team for Core System packages
sys-fs/xfsprogs ebuild removes /var/lib/xfsprogs which is used by xfs_scrub_all
953881 - Assigned to Gentoo's Team for Core System packages
sys-apps/util-linux-9999 missing dependency app-shells/bash-completion
953990 - Assigned to Gentoo's Team for Core System packages
sys-fs/xfsprogs: xfs_scrub_all needs dev-python/dbus-python
955070 - Assigned to Gentoo's Team for Core System packages
sys-fs/dd-rescue-1.99.21 build fails: error: inlining failed in call to 'always_inline' '_mm_popcnt_u32': target specific option mismatch
955211 - Assigned to Gentoo's Team for Core System packages
app-crypt/gpgme-1.24.2: gpgme-1.24.2.tar.bz2.sig VERIFY FAILED!
955271 - Assigned to Gentoo's Team for Core System packages
dev-libs/libgcrypt-1.11.0-r2 fails to build on sparc (32bit)
955704 - Assigned to Gentoo's Team for Core System packages
sys-block/sedutil-1.20.0 - GitVersion.sh:line <snip>: which: command not found
955958 - Assigned to Gentoo's Team for Core System packages
net-firewall/iptables-1.8.11-r1 error: redefinition of struct ethhdr
956290 - Assigned to Gentoo's Team for Core System packages
app-shells/bash-5.2_p37 fails to emerge with LTO+PGO on LLVM profile
956293 - Assigned to Gentoo's Team for Core System packages
sys-boot/syslinux-6.04_pre1-r5 - /.../sh:line <snip>: which: command not found
956497 - Assigned to Gentoo's Team for Core System packages
dev-build/meson-1.8.1 fails test - E mesonbuild.utils.universal.EnvironmentException: Unknown compiler(s): [[clang], [gcc]]
956670 - Assigned to Gentoo's Team for Core System packages
sys-libs/libnvme-1.14 fails test - ImportError: libnvme.so.1: cannot open shared object file: No such file or directory
956758 - Assigned to Gentoo's Team for Core System packages
sys-apps/util-linux-2.41 - fails misc/enosys, misc/swaplabel, mkswap/mkswap on musl
956875 - Assigned to Gentoo's Team for Core System packages
sys-apps/findutils-4.10.0[+test] - ../tests/xargs/test-sigusr.o ld.lld: error: undefined symbol: error
956878 - Assigned to Gentoo's Team for Core System packages
dev-build/meson-1.7.2 test fail : test cases/frameworks/15 llvm/meson.build:56:2: ERROR: Assert failed: config-tool and cmake returns different major versions
957291 - Assigned to Gentoo's Team for Core System packages
sys-process/procps-4.0.5-r2 - QA Notice: Found the following implicit function declarations in configure logs:
958299 - Assigned to Gentoo's Team for Core System packages
sys-libs/pam: pam should add USE flag doc
958526 - Assigned to Gentoo's Team for Core System packages
sys-libs/pam-1.7.1 compile failed to build the documentation.
958980 - Assigned to Gentoo's Team for Core System packages
sys-fs/fuse should check for CONFIG_FUSE_FS (Slow open/save dialogs in Chromium with Plasma 6.4 Wayland)
959098 - Assigned to Gentoo's Team for Core System packages
dev-libs/libgcrypt-1.11.1 Fails with -mfpmath=sse on x86 - error: #error libgcrypt requires thread-local storage to support FIPS mode
959349 - Assigned to Gentoo's Team for Core System packages
app-crypt/pinentry-1.3.1-r1 - [meson] [jdk25] [gettext] [gcc-16] Failed running autoconf!
959774 - Assigned to Gentoo's Team for Core System packages
dev-libs/openssl-compat-1.0.2u-r2 build fails with kerberos USE flag enabled
959807 - Assigned to Gentoo's Team for Core System packages
sys-libs/readline-8.3-r2 - [meson] pty.c: error: implicit declaration of function openpty
960536 - Assigned to Gentoo's Team for Core System packages
dev-build/meson-1.7.2: generates incorrect --gresourcesdir= arguments
960774 - Assigned to Gentoo's Team for Core System packages
sys-apps/baselayout: /etc/profile clobbers PATH, breaking WSL `interop` settings
961809 - Assigned to Gentoo's Team for Core System packages
net-misc/dhcp: last rites
961832 - Assigned to Gentoo's Team for Core System packages
sys-apps/keyutils-1.6.3-r1 fails test features/builtin_trusted
962057 - Assigned to Robin Johnson
app-portage/elt-patches: eltpatch assumes /bin/bash exists, which might not work in a prefix
962141 - Assigned to Gentoo's Team for Core System packages
dev-libs/libassuan-3.0.2 version bump
962170 - Assigned to Gentoo's Team for Core System packages
app-crypt/pinentry-1.3.2 - [jdk25] [gcc-16] ld: /.../libQt6WaylandClient.so.6: undefined reference to QPlatformBackingStore::rhiFlush(QWindow , double, QRegion const&, QP
962340 - Assigned to Gentoo's Team for Core System packages
sys-apps/kexec-tools: LOAD_DURING_SHUTDOWN config option does not work
962529 - Assigned to Yuan Liao (Leo3418)
sys-apps/kexec-tools: missing support for efistub installkernel use flag
962531 - Assigned to Yuan Liao (Leo3418)
sys-apps/kexec-tools: Incorrect kernel image version sorting
962730 - Assigned to Yuan Liao (Leo3418)
net-fs/nfs-utils is missing an init.d file for fsidd
962831 - Assigned to Gentoo's Team for Core System packages
dev-build/meson-1.9.0 fails test - [gcc-16] test cases/.../15 llvm/meson.build: ERROR: Assert failed: config-tool and cmake returns different major versions
962869 - Assigned to Gentoo's Team for Core System packages
dev-libs/libusb-1.0.29 fails test - [gcc-16] FAIL: stress
962873 - Assigned to Gentoo's Team for Core System packages
sys-apps/ucspi-unix-1.0-r1: Build fails on musl due to incorrect includes
962909 - Assigned to Gentoo's Team for Core System packages
dev-libs/libxml2-2.14.6 is not built with zlib anymore
963483 - Assigned to Sam James
dev-util/dialog-1.3.20250116-r1 - [meson] [gcc-16] [boost-1.89] QA Notice: Found the following implicit function declarations in configure logs:
963587 - Assigned to Gentoo's Team for Core System packages
sys-apps/install-xattr: Homepage url is outdated
963698 - Assigned to Gentoo's Team for Core System packages
sys-apps/fakeroot-1.33-1: error: call to undeclared function 'SEND_GET_XATTR'
963892 - Assigned to Gentoo's Team for Core System packages
sys-apps/fakeroot-1.33-1: error: typedef redefinition with different types
963893 - Assigned to Gentoo's Team for Core System packages
app-admin/sudo-1.9.17_p2 get_pty.c:66:9: error: implicit declaration of function ‘openpty’
963900 - Assigned to Gentoo's Team for Core System packages
sys-apps/util-linux-2.41.2[-su] still installs /etc/pam.d/su-l
963950 - Assigned to Gentoo's Team for Core System packages
sys-apps/coreutils: add doclike coloring for .docx, .odt, etc.
963982 - Assigned to Gentoo's Team for Core System packages
net-misc/curl-8.16.0-r1: mbedTLS 3.2.0 or later required
964194 - Assigned to Matt Jolly
sys-apps/baselayout: $HOME/.local/bin is not in $PATH
964354 - Assigned to Gentoo's Team for Core System packages
>=net-misc/openssh-10.1_p1 may not connect in some networks in default settings
964373 - Assigned to Gentoo's Team for Core System packages
dev-libs/libcbor-0.14.0 - [boost-1.89] [ffmpeg8] [gcc-16] [jdk25] QA Notice: Compatibility with CMake < 3.10 will be removed in a future release.
964585 - Assigned to Gentoo's Team for Core System packages
sys-apps/baselayout: Provide a way to remove /usr/local/sbin from PATH and ROOTPATH
964689 - Assigned to Gentoo's Team for Core System packages
app-crypt/pinentry: wrong LICENSE
964694 - Assigned to Gentoo's Team for Core System packages
dev-libs/openssl-3.4.3 installs over 7000 items of documentation
964801 - Assigned to Gentoo's Team for Core System packages
sys-devel/gettext-0.23.2[java]: ensure to set javac's '-target' option's value according to the 'virtual/jre' version specified in the ebuild
965022 - Assigned to Gentoo's Team for Core System packages
net-misc/openssh: XMSS removal results in inability to start sshd
965054 - Assigned to Gentoo's Team for Core System packages
sys-fs/mtools-4.0.49: miscompiled on time64 variant of x86
965409 - Assigned to Gentoo's Team for Core System packages
dev-libs/openssl-3.4.3 fails to install, ecompress: one or more symlinks couldn't be repaired
965423 - Assigned to Gentoo Linux bug wranglers
sys-libs/zlib-ng-2.2.5-r1 with ABI_X86=32 fails to compile tests
965557 - Assigned to Gentoo's Team for Core System packages
media-libs/libpng-1.6.50-r1 fails pngtest-all test if virtual/zlib is sys-libs/zlib-ng
965559 - Assigned to Gentoo's Team for Core System packages
dev-debug/strace fails to compile on hppa: xlat/scmvals.h:102:1: error: static assertion failed: "SCM_DEVMEM_LINEAR != 0x4e"
965573 - Assigned to Gentoo's Team for Core System packages
app-crypt/gpa: consider app-alternatives/gpg
965594 - Assigned to Gentoo's Team for Core System packages
sys-apps/smartmontools: consider app-alternatives/gpg
965643 - Assigned to Gentoo's Team for Core System packages
sys-fs/cryptsetup: consider app-alternatives/gpg
965644 - Assigned to Gentoo's Team for Core System packages
net-misc/curl-8.17.0 upstream has dropped app-crypt/heimdal support
966046 - Assigned to Matt Jolly
net-libs/gnutls: configure test confused by lld's --no-undefined-version default
966252 - Assigned to Gentoo's Team for Core System packages
sys-auth/pambase: User 'Welcome to Linux' message appears after every reboot
966355 - Assigned to Gentoo's Team for Core System packages
app-crypt/gpa-0.11.0-r1 leaves imagesrc/gpa.png in the build directory
966859 - Assigned to Gentoo's Team for Core System packages
dev-build/meson-1.9.1 test fail : 2 tests : doxygen : ninja explain: deps for 'libspede.so.p/src_spede.cpp.o' are missing ; ../test cases/frameworks/25 hdf5/main.cpp:2:10: fatal error: H5Cpp.h: No such file or directory
966868 - Assigned to Gentoo's Team for Core System packages
sys-devel/gettext always selected for rebuild at world update
966925 - Assigned to Gentoo Linux bug wranglers
net-misc/dhcp chroot issue
967016 - Assigned to Gentoo's Team for Core System packages
app-alternatives/yacc: incorrect description for USE flag 'bison'
967036 - Assigned to Gentoo's Team for Core System packages
sys-apps/pcsc-lite-2.4.0-r1 - [gcc-16] QA Notice: The ebuild is installing to one or more unexpected directories:
967374 - Assigned to Gentoo's Team for Core System packages
sys-apps/baselayout: does not ensure presence of /srv (part of FHS 2.3)
967503 - Assigned to Gentoo's Team for Core System packages
app-shells/bash-5.3_p3-r3[pgo]: sandbox violation with setfont in /etc/bash/bashrc
967645 - Assigned to Gentoo's Team for Core System packages
sys-apps/rng-tools-6.17-r1 un-commenting #WATERMARK=2048 in /etc/conf.d/rngd breaks rngd
967647 - Assigned to Gentoo's Team for Core System packages
dev-libs/popt missing virtual/iconv dependency
967683 - Assigned to Gentoo's Team for Core System packages
sys-devel/gcc: ICE when building sys-libs/libseccomp with LTO (flags_from_decl_or_type, at calls.cc:895)
967835 - Assigned to Gentoo Toolchain Maintainers
dev-build/make: doesn't return allocated token to jobserver (dev-build/steve-1.3.0: (make) returned incorrect token value 0x2b, please report a bug upstream)
967886 - Assigned to Gentoo's Team for Core System packages
dev-build/meson-1.10.0: fails to build sci-astronomy/siril-1.4.0 (subprojects/htmesh/meson.build:21:0: ERROR: Got unknown keyword arguments "soversion", "version")
968000 - Assigned to Gentoo's Team for Core System packages
dev-build/meson-1.10.0 fails test - [gcc-16] FAILED unittests/failuretests.py::FailureTests::test_sdl2_notfound_dependency
968589 - Assigned to Gentoo's Team for Core System packages
sys-fs/lvm2: device-mapper runscript still does not support multi-line tables in dmtab
968871 - Assigned to Gentoo's Team for Core System packages
dev-lang/yasm: last rites?
968923 - Assigned to Gentoo's Team for Core System packages
sys-apps/nawk-20251225 - [portage-9999] awkgram.tab.c: error: expected expression at end of input
969159 - Assigned to Gentoo's Team for Core System packages
app-alternatives/lzip: add app-arch/pdlzip alternative
969450 - Assigned to Gentoo's Team for Core System packages
sys-apps/kbd: also build optional programs
969487 - Assigned to Gentoo's Team for Core System packages
dev-build/make-4.4.1-r102 fails test - [gcc-16] [glibc-2.43] [meson] features/jobserver ...................................... FAILED (17/19 passed)
969494 - Assigned to Gentoo's Team for Core System packages
sys-apps/nawk-20251225 - [boost-1.90] [meson] [portage-9999] lib.c:(<snip>) undefined reference to curfname
969609 - Assigned to Gentoo's Team for Core System packages
net-firewall/nftables-1.1.7 - [gcc-16] [glibc-2.43] [meson] QA Notice: Test suite passed but did not actually execute any tests:
969658 - Assigned to Gentoo's Team for Core System packages
sys-auth/sssd-2.9.8 - [boost-1.90] [portage-9999] ld: cannot find -lsss_debug: No such file or directory
969707 - Assigned to Gentoo's Team for Core System packages
dev-libs/libgcrypt-1.12.0-r2 fails to build on m68k (both m68k-unknown-linux-gnu and m68k-aligned-linux-gnut64)
969733 - Assigned to m68k team
dev-build/meson-1.9.2 fails "linuxlike: 13 cmake dependency" test
969803 - Assigned to Gentoo's Team for Core System packages
sys-fs/xfsprogs-6.18.0 enables experimental features by default on stable kernels
969909 - Assigned to Gentoo's Team for Core System packages
app-arch/xz-utils-5.8.2[+pgo] - segfaults all tests when built with '-O2 -fno-plt'
969925 - Assigned to Gentoo's Team for Core System packages
app-admin/rasdaemon: require CONFIG_TRACEFS_AUTOMOUNT_DEPRECATED with kernel 6.18
970453 - Assigned to Gentoo's Team for Core System packages
sys-apps/gawk-5.4.0: test failure with _gsubnulli18n and _unicode1 without en_US.UTF_8 (was: tests open less and get stuck)
970495 - Assigned to Gentoo's Team for Core System packages
sys-libs/ncurses: library ignores $TERMINFO and ~/.terminfo, breaking x11-terms/kitty
970500 - Assigned to Gentoo's Team for Core System packages
dev-libs/leancrypto-1.8.0 - [gcc-16] QA Notice: The following files contain writable and executable sections
970535 - Assigned to Gentoo's Team for Core System packages
app-admin/logrotate-3.22.0 fails test - [boost-1.90] [jdk26] FAIL: test-0111.sh
970759 - Assigned to Gentoo's Team for Core System packages
app-arch/dump-0.4.54 - [gcc-16] main.c:(<snip>) undefined reference to get_device_name
970780 - Assigned to Gentoo's Team for Core System packages
sys-libs/ncurses-6.5_p20251220[ada] - [gcc-16] emake failed
970967 - Assigned to Gentoo's Team for Core System packages
sys-devel/gettext-0.26 build failure
971263 - Assigned to Gentoo's Team for Core System packages
sys-process/procps-4.0.5-r4: QA Notice pidfd_open implicit declaration
971382 - Assigned to Gentoo's Team for Core System packages
sys-devel/gettext-0.23.2: multiple test failures on musl
971404 - Assigned to Gentoo's Team for Core System packages
sec-keys/openpgp-keys-ludovicrousseau-20260204 fails test - [gcc-16] [jdk26] [portage-9999] ERROR: sec-keys/openpgp-keys-ludovicrousseau-20260204::gentoo failed (test pha
971420 - Assigned to Gentoo's Team for Core System packages
dev-build/meson-1.9.2 tests fail: linuxcrosstests.py::LinuxCrossMingwTests::test_cross_pkg_config_option linuxcrosstests.py::LinuxCrossMingwTests::test_exe_wrapper_behaviour failuretests.py::FailureTests::test_sdl2_notfound_dependency
971473 - Assigned to Gentoo's Team for Core System packages
sys-block/vdo-8.3.2.1 - [jdk26] [portage-9999] QA Notice: Files built without respecting LDFLAGS have been detected
971479 - Assigned to Robin Johnson
sys-apps/coreutils-9.9-r1: test failure on ppc64-musl [tests/ls/removed-directory.sh]
971481 - Assigned to Gentoo's Team for Core System packages
dev-build/cmake-4.1.4: Test failures on ppc64 musl
971515 - Assigned to Gentoo's Team for Core System packages
dev-libs/leancrypto-1.6.0-r3 link failure "undefined section .init" with riscv-musl-llvm profile
971680 - Assigned to Gentoo's Team for Core System packages
sys-boot/grub-2.14-r5[grub_platforms_emi,libzfs] grub-core/osdep/unix/getroot.c:170:(.text+0xd843): undefined reference to `grub_get_libzfs_handle'
972543 - Assigned to Mike Gilbert
sys-apps/texinfo-7.3 fails test "converters_tests.t 682 - multitable_prototypes converted latex_text"
972679 - Assigned to Gentoo's Team for Core System packages
dev-libs/libgcrypt-1.12.1: Error: CFI instruction used without previous .cfi_startproc
972784 - Assigned to Gentoo's Team for Core System packages
dev-libs/leancrypto-1.7.2-r3 fails test - 55/409 regression - leancrypto:X.509/PKCS8 keygen/.../sigver ML-DSA87-ED448 FAIL 0.33s exit status 1
972913 - Assigned to Gentoo's Team for Core System packages
sys-apps/shadow-4.19.4 fails test - [meson] [openssl-4] test_chkname.c:(<snip>) undefined reference to mallocarray
972915 - Assigned to Gentoo's Team for Core System packages
dev-build/meson-1.11.1 fails test - [meson] [openssl-4] FAILED: [code=1] execpp.p/main.cpp.o
973033 - Assigned to Gentoo's Team for Core System packages
sys-fs/mdadm-4.6: Please provide the raid6check executable
973286 - Assigned to Gentoo's Team for Core System packages
sys-apps/man-db-2.13.1-r1 fails to build on systems with no 'man' user
973389 - Assigned to Gentoo's Team for Core System packages
sys-process/htop: consider removing USE=filecaps entirely
973484 - Assigned to Gentoo's Team for Core System packages
dev-db/sqlite-3.51.3 - [jdk26] QA Notice: Files built without respecting LDFLAGS have been detected
973554 - Assigned to Jakov Smolić
sys-apps/fakeroot-1.33 fails test - [jdk26] FAIL: t.chown
973588 - Assigned to Gentoo's Team for Core System packages
net-misc/openssh: emerge failed if USE="audit static"
974357 - Assigned to Gentoo's Team for Core System packages
sys-apps/fakeroot-1.33 fails test - FAIL: t.chmod_dev
974358 - Assigned to Gentoo's Team for Core System packages
app-shells/bash: unset variable in 10-gentoo-title.bash
974490 - Assigned to Gentoo's Team for Core System packages
dev-libs/leancrypto-1.8.0 installs '.a' files without static-libs USE
974808 - Assigned to Gentoo's Team for Core System packages
dev-build/make-4.4.1-r102 fails test features/include: Error running .../make (expected 0; got 512)
975100 - Assigned to Gentoo's Team for Core System packages
dev-libs/leancrypto: fails to build (compile phase) on arm, global USE flag "asm" not supported by CPU
975258 - Assigned to Gentoo's Team for Core System packages
net-misc/openssh-10.3_p1: test_kex fails with 'incorrect signature' on RISC-V when you enable -O3 and autovectorization
975669 - Assigned to Gentoo's Team for Core System packages
net-nds/gssproxy-0.9.2-r1: src/gp_rpc_process.c:297:12: error: assignment to ‘int (*)(XDR *, void *)’ from incompatible pointer type ‘xdrproc_t’ {aka ‘int (*)(void)’} [-W incompatible-pointer-types]
975981 - Assigned to Gentoo's Team for Core System packages
app-arch/dump-0.4.54[debug] fails to compile: dirs.c:378:39: error: invalid type argument of -> (have struct direct)
976126 - Assigned to Gentoo's Team for Core System packages
net-fs/nfs-utils-2.8.5 installs udev rules without inheriting udev.eclass
976191 - Assigned to Gentoo's Team for Core System packages
net-misc/iputils-20250605-r4 installs the same files with USE=doc
976306 - Assigned to Gentoo's Team for Core System packages
sys-devel/gettext-0.23.2 [git] - error: refs/.../gettext-0.18.3 does not point to a valid object!
976494 - Assigned to Gentoo's Team for Core System packages
dev-build/autoconf-2.73-r2 fails test 327: AC_PROG_CPP via CC FAILED (c.at:212)
976772 - Assigned to Gentoo's Team for Core System packages
sys-process/htop-3.5.1 fail with clang libunwind
976783 - Assigned to Gentoo's Team for Core System packages
net-firewall/arptables-0.0.5-r2 - [boost-1.91] [jdk26] install: cannot create regular file /.../arptables-save: No such file or directory
976929 - Assigned to Gentoo's Team for Core System packages
sys-process/procps: 'watch' running under 'screen' mis-handles terminal window resize
976963 - Assigned to Gentoo's Team for Core System packages
sys-apps/util-linux-2.42.1: agetty TTY repeating login prompt
976967 - Assigned to Gentoo's Team for Core System packages
sys-apps/gsmartcontrol-2.0.2 bump request
976972 - Assigned to Gentoo's Team for Core System packages
dev-build/autoconf-2.13-r9 (SHELL=/bin/fish) test fail : /usr/share/dejagnu/libexec/config.guess (line 7): Unsupported use of '='. In fish, please use 'set timestamp '2025-07-10''.
976974 - Assigned to Gentoo's Team for Core System packages
sys-boot/grub-themes-gentoo installs themes into /boot
977059 - Assigned to Andreas K. Hüttel
dev-build/meson-1.10.2 fails 'frameworks: 5 protocol buffers' tests with dev-cpp/abseil-cpp-20260107.1
977123 - Assigned to Gentoo's Team for Core System packages
app-crypt/gnupg-2.5.20-r1 fails test - [meson] [portage-9999] Failed tests: tests/.../unimportable.scm tests/.../longpassphrase.scm tests/.../ecc.scm tests/.../rsa.scm te
977205 - Assigned to Gentoo's Team for Core System packages
dev-libs/openssl-3.5.7 fails test 70-test_tlsextms.t
977473 - Assigned to Gentoo's Team for Core System packages
sys-apps/shadow-4.19.4 fails tests with clang: chkname.c:(.text+0xc6): undefined reference to `strchriscntrl'
977882 - Assigned to Gentoo's Team for Core System packages
sys-boot/grub-2.14: fails to dual-boot Windows with sys-boot/shim-16.1_p8 and USE=secureboot
978034 - Assigned to Gentoo's Team for Core System packages
sys-fs/xfsprogs: 7.0.1 Fails to emerge when trying to delete libhandle.a
978062 - Assigned to Gentoo's Team for Core System packages
net-fs/nfs-utils 2.6.4 stopped providing /etc/conf.d/nfs
978118 - Assigned to Gentoo's Team for Core System packages
sec-keys/openpgp-keys-tytso-20260115 fails test - [eigen-5.0] [portage-9999] ERROR: sec-keys/openpgp-keys-tytso-20260115::gentoo failed (test phase):
978129 - Assigned to Gentoo's Team for Core System packages
sec-keys/openpgp-keys-patch-20250206 fails test - [eigen-5.0] [portage-9999] ERROR: sec-keys/openpgp-keys-patch-20250206::gentoo failed (test phase):
978195 - Assigned to Gentoo's Team for Core System packages
dev-libs/openssl-3.5.7 test fail : test_quic_radix.t
978258 - Assigned to Gentoo's Team for Core System packages
sec-keys/openpgp-keys-libtasn1-20260210-r1 fails test - [eigen-5.0] [portage-9999] ERROR: sec-keys/openpgp-keys-libtasn1-20260210-r1::gentoo failed (test phase):
978281 - Assigned to Gentoo's Team for Core System packages
net-libs/gnutls-3.8.13 fails test: test-getaddrinfo
978410 - Assigned to Gentoo's Team for Core System packages
net-misc/openssh-10.4_p1 fails test - make[1]: [Makefile:<snip>: t-exec-interop] Error 1
978966 - Assigned to Gentoo's Team for Core System packages
sys-boot/shim-16.1_p8: warning message / failure to boot (HW / UEFI specific) on Alienware 18 Area-51 AA18250
978987 - Assigned to Nowa Ammerlaan
sec-keys/openpgp-keys-bradking-20250904 fails test - [eigen-5.0] [perl-5.44] [portage-9999] ERROR: sec-keys/openpgp-keys-bradking-20250904::gentoo failed (test phase):
979023 - Assigned to Gentoo's Team for Core System packages
dev-db/sqlite-3.53.3: cross compiling fails with USE="icu": ld.lld: error: *.so is incompatible with elf32ppclinu
979255 - Assigned to Jakov Smolić
sys-boot/grub-2.14-r5 (with llvm): ld: error: section '.text' address (0x200000) is smaller than image base (0x10000000); specify --image-base
979429 - Assigned to Mike Gilbert
sys-apps/gentoo-functions: introduce 'pipestatus' command from EAPI 9
979516 - Assigned to William Hubbs
sys-boot/syslinux-6.04_pre1-r5 Unable to install extlinux to the root partition with Qemu, BIOS and GPT
979795 - Assigned to Gentoo's Team for Core System packages
sys-apps/gawk-5.4.1 fails test intformat with clang-22.1.8 and -march=sandybridge
979806 - Assigned to Gentoo's Team for Core System packages
net-misc/keychain-3.0.1 version bump
980018 - Assigned to Gentoo's Team for Core System packages
sys-auth/pambase-20260730: Blocks alternate init systems
980188 - Assigned to Gentoo's Team for Core System packages
dev-libs/leancrypto-1.8.0 fails tests when mold is set as linker
980303 - Assigned to Gentoo's Team for Core System packages
sys-auth/pambase: Support for Home Directory Encryption Using fscrypt
980351 - Assigned to Gentoo's Team for Core System packages
sys-boot/shim-16.1_p8: package version pulled / deleted by upstream
980367 - Assigned to Nowa Ammerlaan
dev-build/autoconf-2.73-r2: fails tests with clang
980410 - Assigned to Gentoo's Team for Core System packages
net-misc/keychain-2.9.8: picks up V from env as version
980414 - Assigned to Gentoo's Team for Core System packages
sys-apps/smartmontools-9999 uses old SVN repo (+does not compile), upstream moved to Github
980416 - Assigned to Gentoo's Team for Core System packages
media-libs/libpng-compat-1.5.30-r1 fails tests: FAIL: test-pngtest.sh
980669 - Assigned to Gentoo's Team for Core System packages
dev-libs/openssl-3.6.3 [binutils-2.47] [gcc-16.2.0] possible miscompile on risc-v with -march=spacemit-x60: test fails with sigbus
980727 - Assigned to Gentoo's Team for Core System packages
dev-build/meson-1.12.0 fails test frameworks: 29 blocks: Dependency "blocks" not found
980764 - Assigned to Gentoo's Team for Core System packages
sys-devel/m4-1.4.21 fails tests with clang: test-float-h.c:39:5: error: use of undeclared identifier 'FLT_IS_IEC_60559'
980811 - Assigned to Gentoo's Team for Core System packages
net-libs/ntirpc: Bump
981236 - Assigned to Gentoo's Team for Core System packages
dev-db/sqlite-3.53.4: Test suite error with clang-specific CFLAGS
981418 - Assigned to Jakov Smolić
sys-block/nbd-3.27.1 - [boost-1.91] [eigen-5.0] [portage-9999] emake failed
981426 - Assigned to Gentoo's Team for Core System packages
dev-build/make-4.4.1-r102: fails tests on musl
981573 - Assigned to Gentoo's Team for Core System packages
sys-apps/attr-2.6.0: fails tests on musl - FAIL: test/attr.run
981584 - Assigned to Gentoo's Team for Core System packages
sys-apps/acl-2.4.0-r2: fails tests on musl - FAIL: test/restore.run
981586 - Assigned to Gentoo's Team for Core System packages
sec-keys/openpgp-keys-coreutils-20260210 fails test - [portage-9999] ERROR: sec-keys/openpgp-keys-coreutils-20260210::gentoo failed (test phase):
981679 - Assigned to Gentoo's Team for Core System packages
net-firewall/nftables-1.1.7 installs the same files with USE=doc
981843 - Assigned to Gentoo's Team for Core System packages
dev-libs/libgpg-error-1.61 - FAIL: t-printf
981887 - Assigned to Gentoo's Team for Core System packages
sys-process/atop version bump
982033 - Assigned to Gentoo's Team for Core System packages
sec-keys/openpgp-keys-libseccomp-20260210 fails test - [meson-9999] [portage-9999] ERROR: sec-keys/openpgp-keys-libseccomp-20260210::gentoo failed (test phase):
982207 - Assigned to Gentoo's Team for Core System packages
net-fs/autofs-5.1.9-r2 with net-libs/libtirpc-1.3.7-r2 lookup(hosts): can't find path in hosts map (was: general protection fault)
982293 - Assigned to Gentoo's Team for Core System packages
app-misc/ca-certificates can skip update-ca-certificates even when update hooks exist
982480 - Assigned to Gentoo's Team for Core System packages
dev-build/libtool-2.6.2 fails tests with mold linker
983096 - Assigned to Gentoo's Team for Core System packages
dev-libs/libpcre2-10.47: JIT non-working on big endian ARM64
983389 - Assigned to Gentoo's Team for Core System packages
dev-build/meson-1.12.1 fails test - E subprocess.CalledProcessError: Command [/.../python3.14, /.../meson.py, setup, --backend=ninja, --prefix, /usr, --cross-file, /.../l
983431 - Assigned to Gentoo's Team for Core System packages
sys-auth/pambase-20251104-r1[pam_krb5]: pam_acct_mgmt() can fail when kerberos authentication success
983578 - Assigned to Gentoo's Team for Core System packages
dev-util/pkgconf-9999 fails to build: autotools are not supported any more
983580 - Assigned to Gentoo's Team for Core System packages
dev-libs/libxslt broken cmake config file on merged-usr (was: media-tv/kodi-22.0_rc1 can't find libxslt after apparently successful configure)
983601 - Assigned to Sam James
net-misc/openssh-10.5_p1: configure: error: seccomp_filter sandbox not supported on loongarch
983796 - Assigned to Gentoo's Team for Core System packages
sys-apps/findutils-4.11.0 fails test - [eigen-5.0] [jdk27] [swig-4.5] FAIL: test-regex-el
984052 - Assigned to Gentoo's Team for Core System packages
sys-process/procps-4.0.6 installs dysfunctional pkill on Hurd
984061 - Assigned to Gentoo's Team for Core System packages
sys-fs/cryptsetup: dmcrypt initscript has troubles with local variables on shells different to bash
984148 - Assigned to Gentoo's Team for Core System packages
sys-boot/grub: default enable pc, efi-32 and efi-64 on x86
984223 - Assigned to Mike Gilbert
dev-build/autoconf-2.73-r2 fails test "275: Substitute and define special characters"
984224 - Assigned to Gentoo's Team for Core System packages
sys-apps/groff-1.24.2::gentoo failed (compile phase) w/ Hurd cross compile (cannot execute: required file not found)
984256 - Assigned to Gentoo's Team for Core System packages
net-firewall/nftables: consider making USE=gmp unconditional
984297 - Assigned to Gentoo's Team for Core System packages
sys-libs/readline-8.3_p6 breaks bash history scrolling when the prompt contains invisible chars
984299 - Assigned to Gentoo's Team for Core System packages
app-shells/bash: checkwinsize shopt default breaks COLUMNS/ROWS override in ebuilds
984547 - Assigned to Gentoo's Team for Core System packages
sys-apps/gawk: drop unneeded BDEPEND on sys-apps/texinfo
984685 - Assigned to Gentoo's Team for Core System packages
dev-db/sqlite-3.54.1[abi_x86_32]: fails tests
984773 - Assigned to Jakov Smolić
sys-apps/pcsc-lite: modernize/remove postinst message
984896 - Assigned to Gentoo's Team for Core System packages
sys-apps/baselayout: using ${PV} as VERSION= in /etc/os-release leads to weird Gentoo versioning
985009 - Assigned to Gentoo's Team for Core System packages
sys-fs/xfsprogs-7.2.1: ./libxfs_api_defs.h:390:41: error: conflicting types for 'libxfs_trans_mod_sb'; have 'void(struct xfs_trans *, uint, long int)'
985155 - Assigned to Gentoo's Team for Core System packages
net-firewall/nftables-1.1.7: fail to compile without xtables
985180 - Assigned to Gentoo's Team for Core System packages
=sec-keys/openpgp-keys-alejandro-colomar-20260122 fails with "gpg: can't connect to the gpg-agent: IPC connect call failed"
985325 - Assigned to Gentoo Linux bug wranglers
Stabilization Bug Reports
dev-libs/libaio-0.3.113_p8: stablereq
967348 - Assigned to Gentoo's Team for Core System packages
sys-apps/sysvinit-3.18: stablereq
973479 - Assigned to William Hubbs
dev-libs/libusb-1.0.30: stablereq
978422 - Assigned to Gentoo's Team for Core System packages
dev-libs/libgpg-error-1.61: stablereq
980140 - Assigned to Gentoo's Team for Core System packages
app-arch/unzip-6.0_p31: security stabilisation
982036 - Assigned to Gentoo's Team for Core System packages
sys-fs/fuse-3.18.3: security stabilisation
983192 - Assigned to Gentoo's Team for Core System packages
sys-block/nbd-3.27.1: stablereq
983861 - Assigned to Gentoo's Team for Core System packages
games-engines/scummvm-2026.3.0 and friends: stablereq
984058 - Assigned to Gentoo Games
app-arch/xz-utils-5.8.4: stablereq
984070 - Assigned to Gentoo's Team for Core System packages
net-misc/chrony-4.9: stablereq
984071 - Assigned to Sam James
dev-build/cmake-4.3.5: stablereq
984075 - Assigned to Gentoo's Team for Core System packages
sys-apps/iproute2-7.2.0: stablereq
984076 - Assigned to Gentoo's Team for Core System packages
sys-fs/xfsprogs-7.2.1: stablereq
984853 - Assigned to Gentoo's Team for Core System packages
Keywording Bug Reports
app-emulation/virt-manager: add ~riscv keyword (WIP)
859625 - Assigned to Virtualization Team
app-alternatives/{awk,bc,bzip2,cpio,gzip,lex,sh,tar,yacc}: keywording
886247 - Assigned to Gentoo's Team for Core System packages
sys-block/thin-provisioning-tools: rekeywording
913711 - Assigned to Robin Johnson
sys-libs/db-5.3: ~mips keywording request
950353 - Assigned to Gentoo's Team for Core System packages
net-libs/gnutls: rekeywording for dev-libs/leancrypto
970506 - Assigned to Gentoo's Team for Core System packages
sys-auth/sssd: Rekeyword
973418 - Assigned to Gentoo's Team for Core System packages
sys-fs/cryptsetup: rekeywording
978282 - Assigned to Gentoo's Team for Core System packages
llvm-core/clang-22.1.8 ~s390 keywording
979778 - Assigned to LLVM support project
sys-auth/pam_xdg: keywording
980119 - Assigned to Alexis
Description
Gentoo Bugzilla is where we track bugs of Gentoo and its packages; you are welcome to report, confirm and resolve bugs:
File a new Bug
Confirm a bug
Participate in our monthly Bugday
Shortcuts
Packages Bugs (1019)
Stabilization Bugs (13)
Keywording Bugs (9)