Packages
Get Gentoo!
gentoo.org sites
gentoo.org
Wiki
Bugs
Forums
Packages
Planet
Archives
Sources
Infra Status
Home
Packages
Maintainers
USE flags
Architectures
About
Gentoo Project
GNU Emacs project
Packages
494
Stabilization
5
Outdated
31
Pull requests
1
Bugs
38
Security
0
Changelog
Bug Reports
app-emacs/ebuild-mode: highlight /etc/portage/make.conf better
346653 - Assigned to Emacs project
app-emacs/ebuild-mode: [PATCH] Optionally enable reasonable defaults for running ebuild command
816354 - Assigned to GNU Emacs project
app-emacs/ebuild-run-mode color support
883613 - Assigned to akater
app-accessibility/emacspeak-56.0-r1 - /.../environment:line <snip>: cd: .../emacspeak: No such file or directory
905763 - Assigned to Gentoo Accessibility Team
app-emacs/dap-mode-0.7-r1 - dap-hydra.el: Error: Symbols value as variable is void: gud-minor-mode-map
909308 - Assigned to GNU Emacs project
app-emacs/elscreen - emerge hangs for 12 hours
909309 - Assigned to GNU Emacs project
app-emacs/d-mode-2.0.12 fails tests
911287 - Assigned to GNU Emacs project
app-emacs/edb-1.34 fails to compile: Error: user-error ("This command doesn’t work in strings or comments")
911291 - Assigned to GNU Emacs project
app-editors/emacs +jit crossdev does not recognize the jit even though gcc has the jit use flag enabled and installed
916511 - Assigned to GNU Emacs project
app-emacs/parsebib-4.3 fails to compile: random/package: build failure because a DEPEND is not scheduled before
923447 - Assigned to Portage team
app-emacs/gnuplot-mode-0.8.1: void function gnuplot-context-sensitive-mode
927655 - Assigned to GNU Emacs project
app-accessibility/emacspeak-56.0-r1 - emacspeak-proced.el: Error: Misplaced t or otherwise clause
927713 - Assigned to Gentoo Accessibility Team
app-accessibility/speechd-el-2.11 - Error: native-lisp-load-failed (/var/tmp/portage/app-accessibility/speechd-el-2.11/homedir/.emacs.d/eln-cache/29.3
927860 - Assigned to William Hubbs
app-emacs/auctex-14.0.5[preview-latex]: missing build dependency on dev-texlive/texlive-latexextra?
938738 - Assigned to GNU Emacs project
app-emacs/elpy-1.35.0_p20220627-r1 fails to compile: TypeError: can only concatenate str (not _StrPath) to str
939836 - Assigned to GNU Emacs project
app-accessibility/speechd-el-2.11 - [libtool] [gcc-15] Error: native-compiler-error ((lambda (arg50 &optional) (let ((f #capitalize-word)) (funcall f arg50))) Compiling /
943626 - Assigned to William Hubbs
app-emacs/org-roam-2.2.2-r3 fails tests
946541 - Assigned to Arsen Arsenović
app-accessibility/emacspeak-60.0-r1 - [meson] [gcc-15] emacspeak-setup.el: Error: Opening directory: No such file or directory, /.../voices-piper
947938 - Assigned to Gentoo Accessibility Team
app-emacs/autoconf-mode: suboptimal in contrast to the emacs built-in mode
959856 - Assigned to GNU Emacs project
app-emacs/llama-1.0.0 (and possibly others) with FEATURES="distcc": libgccjit.so: error: error invoking gcc driver
960746 - Assigned to Gentoo Toolchain Maintainers
app-emacs/mailcrypt: consider app-alternatives/gpg
965607 - Assigned to GNU Emacs project
app-emacs/emacs-ipython-notebook: needs upgrade to Python 3.14
973739 - Assigned to GNU Emacs project
app-emacs/elpy-1.35.0_p20260415 fails tests: AssertionError: {nam[45 chars]None=..., target: Optional[Callable[..., Any[121 chars]..]} != {nam[45 chars]None=None, target: Callable[..., object] | N[126 chars]ne]}
976378 - Assigned to GNU Emacs project
app-emacs/mmm-mode-0.5.11 fails tests: Ran 11 tests, 1 results as expected, 10 unexpected
976379 - Assigned to GNU Emacs project
app-emacs/org-mode-9.8.4 fails tests: FAILED 160/1132 in-file (0.020168 sec) at test-ob-sqlite.el:61
976380 - Assigned to GNU Emacs project
app-emacs/shell-maker-0.91.2-r1 fails tests: FAILED 1/47 markdown-overlays-image-file-paths-test-absolute (0.000594 sec) at markdown-overlays-images-tests.el:105
976420 - Assigned to GNU Emacs project
app-emacs/agent-shell-0.71.2 fails tests: FAILED 143/180 agent-shell-markdown-resize-image-applies-max-width (0.000147 sec) at agent-shell-markdown-tests.el:499
980754 - Assigned to GNU Emacs project
net-mail/mu-1.14.3 fails tests: 25/48 mu:test-message FAIL 0.41s killed by signal 6 SIGABRT
981065 - Assigned to GNU Emacs project
app-emacs/boogie-friends-0.1_p20260805 fails to compile: lsp-dafny.el:18:11: Error: Cannot open load file: No such file or directory, lsp-mode
983750 - Assigned to GNU Emacs project
app-editors/emacs fails to install a binpkg on raspberry pi
984207 - Assigned to GNU Emacs project
app-editors/emacs: consider making USE=gmp unconditional
984298 - Assigned to GNU Emacs project
net-mail/mu-1.14.4-r1 fails to compile with dev-lang/python-exec[-native-symlinks]
984332 - Assigned to GNU Emacs project
Stabilization Bug Reports
app-emacs/agent-shell-0.74.3: stablereq
982424 - Assigned to GNU Emacs project
app-emacs/emacs-jabber-0.11.1 and friends: stablereq
984490 - Assigned to GNU Emacs project
Keywording Bug Reports
app-emacs/ebuild-mode-1.89: Please rekeyword
968224 - Assigned to GNU Emacs project
app-emacs/emacs-jabber-0.11.1: Please rekeyword
977598 - Assigned to GNU Emacs project
app-emacs/gnuplot-mode: rekeywording - alpha, hppa and sparc
977643 - Assigned to GNU Emacs project
app-emacs/company-mode-1.1.0: rekeywording (~arm ~arm64 ~hppa ~ppc ~ppc64 ~riscv ~sparc ~x64-macos)
980190 - Assigned to GNU Emacs project
Description
Gentoo Bugzilla is where we track bugs of Gentoo and its packages; you are welcome to report, confirm and resolve bugs:
File a new Bug
Confirm a bug
Participate in our monthly Bugday
Shortcuts
Packages Bugs (32)
Stabilization Bugs (2)
Keywording Bugs (4)