Packages
Get Gentoo!
gentoo.org sites
gentoo.org
Wiki
Bugs
Forums
Packages
Planet
Archives
Sources
Infra Status
Home
Packages
Maintainers
USE flags
Architectures
About
Gentoo Project
Python
Packages
1400
Stabilization
0
Outdated
35
Pull requests
13
Bugs
968
Security
47
Changelog
Bug Reports
dev-python/dbus-python: builds tests with FEATURES=-test (PATCH)
226347 - Assigned to Freedesktop bugs
dev-python/pyxattr-0.5.0 fails tests on system without xattr support
315267 - Assigned to Robin Johnson
dev-python/matplotlib: bundles x11-libs/agg
456766 - Assigned to Gentoo Science Related Packages
dev-python/numpy fails to detect ATLAS
469116 - Assigned to Gentoo Science Related Packages
dev-python/wxpython leaves orphaned wxversion.py[co] files in site-packages
481488 - Assigned to Gentoo wxWidgets project
dev-python/wxpython: does magic on top of Python script wrapping
484420 - Assigned to Gentoo wxWidgets project
dev-lang/python builds fail with "-fopenmp" in CFLAGS/CXXFLAGS
634064 - Assigned to Python Gentoo Team
dev-python/pyxattr-0.6.0 : FAILED (errors=18)
635952 - Assigned to Robin Johnson
dev-python/pbr-3.1.1 access violation with pypy3
637160 - Assigned to Matthew Thode ( prometheanfire )
dev-python/bcrypt-3.1.4 fails test tests/test_bcrypt.py - UnicodeEncodeError: 'ascii' codec can't encode characters in position 0-7: ordinal not in range(128)
637228 - Assigned to Python Gentoo Team
dev-python/jsonrpclib-0.3.1 fails test: FAIL: testJoin (tests.test_threadpool.ThreadPoolTest)
641532 - Assigned to Python Gentoo Team
dev-python/pyphen: bundles a lot of dictionaries, in multiple copies
656488 - Assigned to Python Gentoo Team
dev-python/pbr-3.1.1 fails to compile when unrelated python modules don't exist (e.g. bleach) for given python version
662928 - Assigned to Matthew Thode ( prometheanfire )
dev-python/tornado-5.1 - ERROR: test_future_write (tornado.test.iostream_test.TestIOStream)
663490 - Assigned to Python Gentoo Team
=dev-python/pbr-4.2.0-r1 fails test pbr.tests.test_packaging.TestPackagingWheels.test_generates_c_extensions
664966 - Assigned to Matthew Thode ( prometheanfire )
dev-lang/python-3.6.5 - Add conditional support for --with-dtrace for profiling
675470 - Assigned to Python Gentoo Team
dev-lang/python-exec-2.4.6: python3_4 reference in /etc/python-exec/python-exec.conf
681660 - Assigned to Python Gentoo Team
dev-python/pycairo-1.17.0-r1 fails test with pypy3: "undefined symbol: PyOS_FSPath"
682870 - Assigned to Python Gentoo Team
dev-lang/python-3.6.? USE=ncurses with sys-libs/ncurses[tinfo] - .../work/Python-3.6.5/python: symbol 'LINES': can't resolve symbol
692128 - Assigned to Python Gentoo Team
dev-python/pymdstat-0.4.2 - ERROR: Package installs 'share' in PyPy prefix, see bug #465546.
693584 - Assigned to Python Gentoo Team
dev-python/odfpy-1.3.6 : error: [Errno 2] No such file or directory
694570 - Assigned to Python Gentoo Team
dev-python/python-neutronclient-6.12.0 USE=doc - OSError: [Errno 2] No such file or directory: 'doc/build/html/.'
696132 - Assigned to Matthew Thode ( prometheanfire )
app-eselect/eselect-python-20190417 - eselect python set python3.6: Couldn't find a man page for python3.6; skipping.
697152 - Assigned to Python Gentoo Team
dev-python/tornado-5.1 USE=doc - src_compile(): loading intersphinx inventory from https://docs.python.org/3.6/objects.inv... Warning, treated as error: failed to reach any of the inventories with the following issues: []
697638 - Assigned to Python Gentoo Team
dev-python/tldextract: package writes to system location
698202 - Assigned to Patrick Lauer
dev-python/wxpython-4.0.6: <built-in>: fatal error: when writing output to : No such file or directory
699046 - Assigned to Gentoo wxWidgets project
dev-python/hypothesis: Enable more tests
700224 - Assigned to Python Gentoo Team
dev-python/strict-rfc3339-0.7-r1: test_strict_rfc3339.TestTimestampToRFC3339UTCOffset, test_strict_rfc3339.TestTimestampToRFC3339UTCOffset fail
702996 - Assigned to Python Gentoo Team
dev-python/wxpython-4.2.3-r2 - Mandatory dependency to gstreamer via x11-libs/wxGTK[gstreamer]
704268 - Assigned to Gentoo wxWidgets project
dev-python/pycryptodome-3.6.6 - src/common.h:161:2: error: #error No routines for aligned memory
704298 - Assigned to Python Gentoo Team
dev-lang/python - Cross-compiled python installs wrong version of lib2to3/Grammar pickle
704816 - Assigned to Python Gentoo Team
dev-python/pylibacl-0.5.3: testEquivMode fails
709782 - Assigned to Robin Johnson
dev-python/cffi-1.13.2: test_func_as_funcptr fails because of -Werror
711090 - Assigned to Python Gentoo Team
dev-python/uvloop-0.14.0[doc] RuntimeError: unable to read the version from setup.py
714784 - Assigned to Python Gentoo Team
dev-lang/python-2.7.17-r2 fails test test_bdb - FAIL: test_skip (test.test_bdb.StateTestCase)
716310 - Assigned to Python Gentoo Team
dev-python/requests-2.23.0: test_use_proxy_from_environment[*https] fails with TypeError: __init__() got an unexpected keyword argument '_socks_options'
716614 - Assigned to Python Gentoo Team
dev-python/pylibacl fails tests
718914 - Assigned to Robin Johnson
dev-python/python-distutils-extra: removal?
719788 - Assigned to Python Gentoo Team
dev-python/docker TCPSocketStreamTest.* failures
720060 - Assigned to Python Gentoo Team
dev-python/matplotlib GUI front end USE flag required
720196 - Assigned to Gentoo Science Related Packages
dev-python/zc-lockfile fails tests
720258 - Assigned to William Hubbs
dev-python/python-dbusmock-0.18.2: test failures
720834 - Assigned to Gentoo Linux Gnome Desktop Team
dev-python/pycurl-7.43.0.5: fails tests (libcurl/*.so: cannot open shared object file)
722284 - Assigned to Python Gentoo Team
dev-python/wxpython fails tests
722716 - Assigned to Gentoo wxWidgets project
dev-python/secretstorage-3.1.2: test failures: secretstorage.exceptions.SecretServiceNotAvailableException: Message recipient disconnected from message bus without replying
723340 - Assigned to Python Gentoo Team
dev-python/flit fails tests
723550 - Assigned to Patrick McLean
dev-python/cffi calls cc directly
723558 - Assigned to Python Gentoo Team
dev-python/mediafile fails tests
723652 - Assigned to No maintainer - Look at https://wiki.gentoo.org/wiki/Project:Proxy_Maintainers if you want to take care of it
dev-python/pycurl-7.43.0.5: failed configure with mbedtls
726306 - Assigned to Python Gentoo Team
dev-python/wxpython-4.0.7: test hangs (lib_agw_piectrl_Tests::test_lib_agw_piectrlMethods)
726812 - Assigned to Gentoo wxWidgets project
dev-python/cherrypy-18.5.0: test failure
726820 - Assigned to Python Gentoo Team
dev-python/blosc-1.11.1 : One or more CMake variables were not used by the project:
727396 - Assigned to Gentoo Science Related Packages
dev-python/eyed3-0.8.11 - eyeD3: WARNING: Plugin '('lastfm.py', '/usr/lib/python3.7/site-packages/eyed3/plugins')' requires packages that are not installed: cannot import name 'COVER_EXTRA_LARGE' from 'pylast' (/usr/lib/python3.7/site-packages/pylast[...]
728072 - Assigned to Gentoo Sound Team
<dev-python/numpy-1.19.0: pypy3 fortran tests fail
729966 - Assigned to Gentoo Science Related Packages
dev-lang/python-3.7.8-r1 fails tests: ERROR: test_session (test.test_ssl.ThreadedTests)
731766 - Assigned to Python Gentoo Team
dev-python/llfuse fails test test_rounding: OverflowError: Python int too large to convert to C long
733298 - Assigned to Python Gentoo Team
dev-python/black: needs pypy3 port
737620 - Assigned to Patrick McLean
dev-python/django-polymorphic-3.1 fails tests
737922 - Assigned to Python Gentoo Team
dev-python/mediafile-0.2.0 fails tests
738006 - Assigned to No maintainer - Look at https://wiki.gentoo.org/wiki/Project:Proxy_Maintainers if you want to take care of it
dev-python/pycurl: replace USE=curl_ssl_* with USE={gnutls,libressl,nss,openssl}
738604 - Assigned to Python Gentoo Team
dev-python/pyyaml-5.3.1 fails tests
738686 - Assigned to Python Gentoo Team
dev-python/whoosh-2.7.4 fails tests
738878 - Assigned to Python Gentoo Team
dev-python/pbr-5.5.0: test_capitalized_headers, test_get_kwargs_corner_cases, test_invalid_tag_ignored, test_non_canonical_tagged_version_bump fail
741550 - Assigned to Python Gentoo Team
dev-python/line-profiler-3.0.2 fails to compile
742635 - Assigned to Gentoo Science Related Packages
dev-python/cffi-1.15.1 fails tests: test_verify_anonymous_struct_with_star_typedef
743181 - Assigned to Python Gentoo Team
dev-python/lz4-3.0.2 fails tests (hang)
743451 - Assigned to Matthew Thode ( prometheanfire )
dev-python/lxml-4.9.1 fails tests
743457 - Assigned to Python Gentoo Team
dev-python/python-dateutil-2.8.1-r2 fails tests
744082 - Assigned to Python Gentoo Team
dev-python/python-dateutil-2.8.1-r2 fails tests with sys-libs/timezone-data-2020b and slim bloats
749594 - Assigned to Python Gentoo Team
dev-python/webob-1.8.6[doc] failed to emerge (pkg_resources.DistributionNotFound: The 'webob' distribution was not found and is required by the application)
750083 - Assigned to Python Gentoo Team
dev-lang/python-3.10.0_alpha1 fails tests: ERROR: test_connect_capath (test.test_ssl.SimpleBackgroundTests)
753359 - Assigned to Python Gentoo Team
dev-python/numpy: automagically linking against libflame.so
757510 - Assigned to Gentoo Science Related Packages
dev-python/eyed3: fails tests ( tar: ./eyeD3-test-data/Metro Pakt - Neue Stra\341en (1981).mp3: Cannot open: Illegal byte sequence)
757663 - Assigned to Gentoo Sound Team
dev-python/lxml-4.6.2: Segmentation fault while building on armv6l
759268 - Assigned to Python Gentoo Team
dev-python/pyglet-1.5.14 fails to save images in alternative formats
763171 - Assigned to Gentoo Science Related Packages
dev-python/xcffib-0.11.1: fails tests (xvfb)
764278 - Assigned to Python Gentoo Team
dev-python/iminuit-2.25.2 installs pre-stripped files
765214 - Assigned to Andrey Grozin
dev-python/pycryptodome-3.9.9-r1 fails tests (hang)
768438 - Assigned to Python Gentoo Team
dev-python/matplotlib-3.3.4 bundles huge amount of fonts
772947 - Assigned to Gentoo Science Related Packages
dev-python/pandas-1.2.1 fails test TestTimestampProperties.test_is_leap_year
773610 - Assigned to Gentoo Science Related Packages
dev-python/pycryptodome-3.10.1 - /.../ld: cannot find -ltomcrypt
779715 - Assigned to Python Gentoo Team
dev-python/python-swiftclient-3.10.1 calls commands that do not exist (line 2816: flake8: command not found)
784626 - Assigned to Matthew Thode ( prometheanfire )
dev-python/djangorestframework-3.12.4 fails tests
785715 - Assigned to Python Gentoo Team
dev-python/pandas-1.2.3-r1: fails one test on x86 (test_rolling_quantile_interpolation_options)
786594 - Assigned to Gentoo Science Related Packages
dev-python/iminuit bundles sci-libs/minuit
787275 - Assigned to Andrey Grozin
dev-python/strict-rfc3339: RuntimeError: dictionary changed size during iteration when emerging with pypy3
788826 - Assigned to Python Gentoo Team
dev-python/amqp-2.6.1 failed to emerge with USE=doc - ModuleNotFoundError: No module named 'vine.five'
789462 - Assigned to Python Gentoo Team
dev-python/imapclient with dev-lang/python-3.9.5_p2 - ssl.SSLError: [SSL: SSLV3_ALERT_HANDSHAKE_FAILURE] sslv3 alert handshake failure
793884 - Assigned to Python Gentoo Team
dev-python/numpy: builds with SSE2 support on CPUs with no support (RuntimeError: NumPy was built with baseline optimizations: (SSE SSE2) but your machine doesn't support: (SSE2).)
794187 - Assigned to Gentoo Science Related Packages
dev-python/uvloop-0.15.2 setuptools warnings detected
796200 - Assigned to Python Gentoo Team
app-arch/brotli-1.0.9-r3 setuptools warnings detected
796281 - Assigned to Craig Andrews
dev-python/feedgenerator-1.9.1-r1 setuptools warnings detected
796293 - Assigned to Python Gentoo Team
dev-python/joblib-1.0.1 setuptools warnings detected
796296 - Assigned to Python Gentoo Team
dev-python/debtcollector-2.2.0 setuptools warnings detected
797481 - Assigned to Matthew Thode ( prometheanfire )
dev-python/testscenarios-0.5.0-r1 setuptools warnings detected
797559 - Assigned to Matthew Thode ( prometheanfire )
dev-python/blinker-1.4-r2 setuptools warnings detected
797757 - Assigned to Python Gentoo Team
dev-python/lockfile-0.12.2-r2 setuptools warnings detected
797763 - Assigned to Python Gentoo Team
dev-python/pyclipper-1.3.0 setuptools warnings detected
797766 - Assigned to Pacho Ramos
dev-python/apipkg-2.0.0_rc1 setuptools warnings detected
797775 - Assigned to Python Gentoo Team
dev-python/bandit-1.7.1 setuptools warnings detected
797787 - Assigned to Matthew Thode ( prometheanfire )
dev-python/bashate-0.6.0 setuptools warnings detected
797790 - Assigned to Matthew Thode ( prometheanfire )
dev-python/commonmark-0.9.1 setuptools warnings detected
797799 - Assigned to Python Gentoo Team
dev-python/keystoneauth1-4.4.0 setuptools warnings detected
797817 - Assigned to Matthew Thode ( prometheanfire )
dev-python/testresources-2.0.1 setuptools warnings detected
797826 - Assigned to Matthew Thode ( prometheanfire )
dev-python/deprecated-1.2.12 setuptools warnings detected
797832 - Assigned to Python Gentoo Team
dev-python/django-3.2.9 setuptools warnings detected
797838 - Assigned to Python Gentoo Team
dev-python/doc8-0.9.1 setuptools warnings detected
797844 - Assigned to Matthew Thode ( prometheanfire )
dev-python/dogpile-cache-1.1.4 setuptools warnings detected
797847 - Assigned to Matthew Thode ( prometheanfire )
dev-python/django-filter-21.1-r2 setuptools warnings detected
797868 - Assigned to No maintainer - Look at https://wiki.gentoo.org/wiki/Project:Proxy_Maintainers if you want to take care of it
dev-python/fastimport-0.9.11 setuptools warnings detected
797913 - Assigned to Python Gentoo Team
dev-python/fqdn-1.5.1-r1 setuptools warnings detected
797925 - Assigned to Python Gentoo Team
dev-python/genson-1.1.0 setuptools warnings detected
797928 - Assigned to Alexey Shvetsov
dev-python/github3-py-2.0.0 setuptools warnings detected
797934 - Assigned to Python Gentoo Team
dev-python/gsd-2.5.0 setuptools warnings detected
797937 - Assigned to Alexey Shvetsov
dev-python/logfury-0.1.2-r1 setuptools warnings detected
798057 - Assigned to William Pettersson
dev-python/mock-4.0.3 setuptools warnings detected
798069 - Assigned to Python Gentoo Team
dev-python/logbook-1.5.3 setuptools warnings detected
798096 - Assigned to Andreas Zuber
dev-python/os-client-config-2.1.0-r1 setuptools warnings detected
798153 - Assigned to Matthew Thode ( prometheanfire )
dev-python/parameterized-0.8.1 setuptools warnings detected
798168 - Assigned to Amy Liffey
dev-python/munch-2.5.0-r1 setuptools warnings detected
798174 - Assigned to Python Gentoo Team
dev-python/ply-3.11-r1 setuptools warnings detected
798177 - Assigned to Python Gentoo Team
dev-python/progressbar2-3.55.0 setuptools warnings detected
798186 - Assigned to No maintainer - Look at https://wiki.gentoo.org/wiki/Project:Proxy_Maintainers if you want to take care of it
dev-python/pyproj-3.1.0 setuptools warnings detected
798216 - Assigned to Python Gentoo Team
dev-python/python-utils-2.5.6 setuptools warnings detected
798219 - Assigned to Python Gentoo Team
dev-python/ntplib-0.4.0 setuptools warnings detected
798246 - Assigned to Zac Medico
dev-python/openstackdocstheme-2.2.5 setuptools warnings detected
798255 - Assigned to Python Gentoo Team
dev-python/django-3.2.8 setuptools warnings detected
798333 - Assigned to Python Gentoo Team
dev-python/pyghmi-1.5.22 setuptools warnings detected
798369 - Assigned to Zac Medico
dev-python/podman-1.6.0 setuptools warnings detected
798540 - Assigned to Zac Medico
dev-python/python-swiftclient-3.10.1 setuptools warnings detected
798543 - Assigned to Matthew Thode ( prometheanfire )
dev-python/pyusb-1.2.1 setuptools warnings detected
798549 - Assigned to Python Gentoo Team
dev-python/python-keystoneclient-4.3.0 setuptools warnings detected
798564 - Assigned to Matthew Thode ( prometheanfire )
dev-python/requests-mock-1.9.3 setuptools warnings detected
798570 - Assigned to Python Gentoo Team
dev-python/requests-unixsocket-0.2.0 setuptools warnings detected
798573 - Assigned to Python Gentoo Team
dev-python/sphinxcontrib-spelling-7.2.1 setuptools warnings detected
798582 - Assigned to Python Gentoo Team
dev-python/urllib3-1.26.7 setuptools warnings detected
798606 - Assigned to Python Gentoo Team
dev-python/wxpython-4.0.7-r1 setuptools warnings detected
798612 - Assigned to Gentoo wxWidgets project
dev-python/python-neutronclient-7.2.1 setuptools warnings detected
798636 - Assigned to Matthew Thode ( prometheanfire )
dev-python/python-novaclient-17.2.1 setuptools warnings detected
798642 - Assigned to Matthew Thode ( prometheanfire )
dev-python/thriftpy2-0.4.14-r1 fails tests
799806 - Assigned to Patrick McLean
dev-python/requests-mock-1.9.3 fails tests
801136 - Assigned to Python Gentoo Team
dev-python/uvloop-0.15.2 - Configuration error:
801319 - Assigned to Python Gentoo Team
dev-lang/python: do not override dev-libs/openssl defaults
804894 - Assigned to Python Gentoo Team
dev-python/uvloop-0.15.3-r1 fails tests (tests.test_tcp.Test_AIO_TCPSSL hangs)
805155 - Assigned to Python Gentoo Team
dev-python/tables-3.6.1-r1: fails tests: tables.tests.test_index_backcompat.Indexes2_*
805995 - Assigned to Python Gentoo Team
dev-python/weasyprint-53.0 doesn’t support woff fonts
807070 - Assigned to Python Gentoo Team
dev-python/matplotlib-3.4.2: test failures on hppa and sparc
807679 - Assigned to Gentoo Science Related Packages
dev-python/aioresponses-0.7.2 setuptools warnings detected
808504 - Assigned to Python Gentoo Team
dev-python/pandas-1.3.1: tests fail with "ValueError: Buffer dtype mismatch, expected 'int64_t' but got 'int'" and similar
809854 - Assigned to Gentoo Science Related Packages
dev-python/weasyprint-53.0 - sandbox issue
810421 - Assigned to Python Gentoo Team
dev-python/google-auth-oauthlib-0.4.6 fails tests
811405 - Assigned to Python Gentoo Team
dev-python/watchdog-2.1.5: error in one test (tests/test_inotify_buffer.py::test_move_to) on s390
811873 - Assigned to Python Gentoo Team
dev-python/sphinx-bootstrap-theme-0.8.0-r1 setuptools warnings detected
812662 - Assigned to Python Gentoo Team
dev-python/pyzmq-22.1.0: fails tests on arm64 (on one machine)
812764 - Assigned to Python Gentoo Team
dev-python/u-msgpack-python-2.7.1 setuptools warnings detected
812890 - Assigned to Python Gentoo Team
dev-python/lxml-4.6.3-r1: QA: compile python_is_python3 is deprecated, as Python 2 is not supported anymore
812992 - Assigned to Python Gentoo Team
dev-python/paramiko: ~/.ssh/known_hosts is overwritten and comments are lost (upstream bug)
813007 - Assigned to Python Gentoo Team
dev-python/pyspf-2.0.14-r2 ignores Domain_Whitelist_PTR option in policyd-spf.conf
813414 - Assigned to Python Gentoo Team
dev-python/pytest-localserver-0.5.0 fails tests - [SSL: CA_MD_TOO_WEAK] ca md too weak (_ssl.c:4081)
818271 - Assigned to Python Gentoo Team
dev-python/utidylib-0.7-r2: fails tests
818526 - Assigned to Python Gentoo Team
dev-python/indexed-gzip-1.6.4 fails tests (hang)
818895 - Assigned to Python Gentoo Team
dev-python/jschema-to-python-1.2.3 setuptools warnings detected
822105 - Assigned to Python Gentoo Team
dev-python/sarif-om-1.0.4 setuptools warnings detected
822108 - Assigned to Python Gentoo Team
dev-python/tornado-6.1 fails tests: - FAIL: test_localhost (tornado.test.netutil_test.CaresResolverTest)
824522 - Assigned to Python Gentoo Team
dev-python/tubes-0.2.0-r1 - ValueError: Newlines are not allowed
825558 - Assigned to Python Gentoo Team
dev-lang/python-3.10.1 test failures: test_bdb test_doctest test_import test_importlib test_pickle test_runpy test_support
828998 - Assigned to Python Gentoo Team
dev-python/krb5-0.2.0 fails to compile: _creds_opt.c:2261:3: error: tp_print is deprecated [-Werror,-Wdeprecated-declarations]
829852 - Assigned to Python Gentoo Team
dev-python/iminuit-2.25.2 does not respect CFLAGS
829853 - Assigned to Andrey Grozin
dev-python/numpy-1.22.1 fails to compile: error: Command "x86_64-pc-linux-gnu-gcc ..." failed with exit status 1
831228 - Assigned to Gentoo Science Related Packages
dev-python/pypy-exe-bin-7.3.9 installs files with unresolved SONAME dependencies
831237 - Assigned to Python Gentoo Team
dev-python/aiohttp-3.8.1 - Could not import extension sphinxcontrib.towncrier (exception: No module named sphinxcontrib.towncrier)
831637 - Assigned to Zac Medico
dev-python/pyproj-3.3.0 - ModuleNotFoundError: No module named pyproj._network
831833 - Assigned to Python Gentoo Team
dev-python/httpcore-0.14.5: fails tests
832295 - Assigned to Python Gentoo Team
dev-python/pandas-1.3.4 - missing build dependency on cython
832517 - Assigned to Gentoo Science Related Packages
dev-python/h2-4.1.0-r1 fails tests
832578 - Assigned to Python Gentoo Team
dev-python/python-socks-2.0.3: fails tests
832822 - Assigned to Python Gentoo Team
dev-python/pytest-regressions-2.8.0: fails tests/test_ndarrays_regression.py::test_different_data_types on Big Endian
832825 - Assigned to Python Gentoo Team
dev-python/matplotlib-3.5.1 fails tests: ImportError: Cannot load backend 'QtAgg'
833099 - Assigned to Gentoo Science Related Packages
=dev-python/sphinx-4.4.0 USE=doc error: deploying.rst:162:unknown document: readthedocs:tutorial/index
833618 - Assigned to Python Gentoo Team
dev-python/aiorpcx-0.22.1 fails tests on MUSL
834558 - Assigned to Python Gentoo Team
dev-python/apsw-3.35.4_p1 fails tests on MUSL
834560 - Assigned to Python Gentoo Team
dev-python/atpublic-2.3 fails tests on MUSL
834562 - Assigned to Python Gentoo Team
dev-python/bpython-0.22.1 fails tests on MUSL
834566 - Assigned to Andrey Grozin
dev-python/django-auth-ldap-3.0.0 fails tests on MUSL
834587 - Assigned to Python Gentoo Team
dev-python/django-configurations-2.3.2 fails tests on MUSL
834589 - Assigned to Python Gentoo Team
dev-python/django-redis-5.2.0 fails tests on MUSL
834591 - Assigned to William Hubbs
dev-python/easyprocess-1.1-r1 fails tests on MUSL
834616 - Assigned to No maintainer - Look at https://wiki.gentoo.org/wiki/Project:Proxy_Maintainers if you want to take care of it
dev-python/fakeredis-1.9.0 fails tests on MUSL
834617 - Assigned to Python Gentoo Team
dev-python/gssapi-1.8.1 fails tests on MUSL
834619 - Assigned to Python Gentoo Team
dev-python/httpx-0.22.0-r1 fails tests on MUSL (hang)
834620 - Assigned to Python Gentoo Team
dev-python/hypothesis-6.54.3 fails tests on MUSL
834652 - Assigned to Michał Górny
dev-python/jc-1.20.4 fails tests on MUSL
834654 - Assigned to Zac Medico
dev-python/joblib-1.1.0-r1 fails tests on MUSL
834655 - Assigned to Python Gentoo Team
dev-python/krb5-0.4.0 fails tests on MUSL
834657 - Assigned to Python Gentoo Team
dev-python/logbook-1.5.3 fails tests on MUSL
834659 - Assigned to Andreas Zuber
dev-python/lz4-4.0.2 fails tests on MUSL
834661 - Assigned to Matthew Thode ( prometheanfire )
dev-python/netaddr-0.8.0-r1 fails tests on MUSL
834681 - Assigned to Python Gentoo Team
dev-python/packaging-21.3-r2 fails tests on MUSL
834707 - Assigned to Python Gentoo Team
dev-python/paramiko-2.11.0 fails tests on MUSL
834708 - Assigned to Python Gentoo Team
dev-python/paramiko-2.9.2-r1 failed to emerge with USE=doc
834714 - Assigned to Python Gentoo Team
dev-python/portend-3.1.0 fails tests on MUSL (hang)
834775 - Assigned to Zac Medico
dev-python/pybtex-docutils-1.0.1 fails tests on MUSL
834812 - Assigned to Nowa Ammerlaan
dev-python/pygresql-5.2.4 fails tests on MUSL
834813 - Assigned to PgSQL Bugs
dev-python/pytest-xprocess-0.18.1 fails tests on MUSL
834818 - Assigned to Python Gentoo Team
dev-python/python-gammu-3.2.4 fails tests on MUSL
834819 - Assigned to Michał Górny
dev-python/psycopg-2.9.3 calls commands that do not exist
834823 - Assigned to Python Gentoo Team
dev-python/redis-4.1.4 fails tests on MUSL
834883 - Assigned to Sam James
dev-python/mrcfile-1.3.0 fails tests on x86
834884 - Assigned to Python Gentoo Team
dev-python/setproctitle-1.3.2 fails tests on MUSL
834889 - Assigned to Python Gentoo Team
dev-python/sphinx-gallery-0.10.1 fails tests on MUSL
834892 - Assigned to Python Gentoo Team
dev-python/strict-rfc3339-0.7-r2 fails tests on MUSL
834895 - Assigned to Python Gentoo Team
dev-python/translate-toolkit-3.7.2 fails tests on MUSL
834953 - Assigned to Python Gentoo Team
dev-python/txamqp-0.8.2 fails tests on MUSL
834956 - Assigned to Python Gentoo Team
dev-python/zconfig-3.6.0-r1 fails tests on MUSL
835041 - Assigned to Python Gentoo Team
dev-python/twisted-22.1.0: twisted-regen-cache in pkg_postinst fails when ROOT != /
835460 - Assigned to Python Gentoo Team
dev-python/ephemeral-port-reserve-1.1.4 fails tests on MUSL: socket.gaierror: [Errno -2] Name does not resolve
836416 - Assigned to Python Gentoo Team
dev-python/dulwich-0.20.35 fails tests
836436 - Assigned to Fabian Groffen
dev-python/cherrypy-18.6.1 fails tests
836437 - Assigned to Python Gentoo Team
dev-python/pywinrm-0.4.2-r1 fails tests
836443 - Assigned to Python Gentoo Team
dev-python/watchdog-2.1.9 fails tests
836477 - Assigned to Python Gentoo Team
dev-python/python-dbusmock-0.26.1 fails test test_dbus_method_called
836551 - Assigned to Gentoo Linux Gnome Desktop Team
dev-python/pywavelets-1.4.1 with USE=doc fails to build: ModuleNotFoundError: No module named 'pywt._extensions._pywt'
836780 - Assigned to Gentoo Science Mathematics related packages
dev-python/anyio-3.6.1 fails tests
837068 - Assigned to Gentoo Science Related Packages
dev-python/statsmodels-0.13.2: failed (test phase) (x86)
840770 - Assigned to Python Gentoo Team
dev-python/twisted-22.4.0: RealDeviceWithProtocolInformationTests and RealDeviceWithoutProtocolInformationTests fail
841818 - Assigned to Python Gentoo Team
dev-lang/python-3.9.12: fails test_flush_return_value test on hppa
842255 - Assigned to Python Gentoo Team
dev-python/pyflakes-2.4.0 fails tests
845003 - Assigned to Python Gentoo Team
dev-python/ecdsa-0.18.0 fails tests
845378 - Assigned to Python Gentoo Team
dev-python/xlsxwriter-3.0.3 fails tests: OSError: [Errno 24] Too many open files: README.md)
846443 - Assigned to Python Gentoo Team
dev-python/pytest-shell-utilities-1.3.0 fails tests
847631 - Assigned to Patrick McLean
dev-python/pytest-aiohttp-1.0.4 fails test_loop_fixture test
850100 - Assigned to Python Gentoo Team
dev-python/cvxopt-1.3.0 - sandbox issue
851042 - Assigned to Gentoo Science Mathematics related packages
dev-python/webcolors-1.12 QA Notice: setuptools warnings detected
851963 - Assigned to Python Gentoo Team
dev-python/python-dateutil - QA Notice: setuptools warnings detected
851966 - Assigned to Python Gentoo Team
dev-python/cffi-1.15.0-r1 - QA Notice: setuptools warnings detected
851969 - Assigned to Python Gentoo Team
dev-python/jinja2-3.1.2 - ERROR: dev-python/jinja2-3.1.2::gentoo failed (compile phase):
853187 - Assigned to Python Gentoo Team
dev-python/feedparser-6.0.10 fails tests
855437 - Assigned to Python Gentoo Team
dev-python/python-xlib-0.31-r1 fails tests on stable amd64
856370 - Assigned to Python Gentoo Team
dev-python/line-profiler-3.5.1 one or more CMake variables were not used by the project
856841 - Assigned to Gentoo Science Related Packages
dev-python/numpy-1.23.1 fails tests
857102 - Assigned to Gentoo Science Related Packages
dev-python/pbr-5.9.0 fails test pbr.tests.test_core.TestCore.test_setup_py_keywords
858680 - Assigned to Matthew Thode ( prometheanfire )
dev-python/blinker-1.5 - FileNotFoundError: [Errno 2] No such file or directory: bdocs/html/.
859334 - Assigned to Python Gentoo Team
dev-python/pycryptodome-3.15.0 fails test test_negate (Crypto.SelfTest.PublicKey.test_ECC_25519.TestEccPoint_Ed25519)
861206 - Assigned to Python Gentoo Team
dev-python/certifi-3021.3.16-r2: The license_file parameter is deprecated, use license_files instead
863338 - Assigned to Python Gentoo Team
dev-python/bottle-0.12.23 fails tests
863560 - Assigned to Python Gentoo Team
dev-python/pyspnego-0.5.3 fails tests on stable amd64
865205 - Assigned to Python Gentoo Team
dev-python/apscheduler-3.9.1 fails tests (MUSL)
865355 - Assigned to Zac Medico
dev-python/pysdl2-0.9.13 fails tests (MUSL)
865357 - Assigned to Michał Górny
dev-python/beautifulsoup4-4.11.1 fails tests (MUSL)
865381 - Assigned to Python Gentoo Team
dev-python/cachelib-0.9.0 fails tests (MUSL)
865473 - Assigned to Python Gentoo Team
dev-python/cattrs-22.1.0 fails tests (MUSL)
865475 - Assigned to Python Gentoo Team
dev-python/fitsio-1.1.7 fails tests (MUSL)
865487 - Assigned to Gentoo Astronomy project
dev-python/django-4.1 fails tests (MUSL)
865493 - Assigned to Python Gentoo Team
dev-python/httpretty-1.1.4-r1 fails tests (MUSL)
865517 - Assigned to Gentoo OpenStack team
dev-python/httpx-0.23.0 fails tests (MUSL): ModuleNotFoundError: No module named chardet
865519 - Assigned to Python Gentoo Team
dev-python/jedi-0.18.1 fails tests (MUSL)
865653 - Assigned to Python Gentoo Team
dev-python/jsonmerge-1.8.0-r1 fails tests (MUSL)
865655 - Assigned to Zac Medico
dev-python/myst-parser-0.18.0 fails tests (MUSL)
865783 - Assigned to Python Gentoo Team
dev-python/natsort-8.2.0 fails tests (MUSL)
865785 - Assigned to Python Gentoo Team
dev-python/notebook-shim-0.1.0 fails tests (MUSL)
865787 - Assigned to Gentoo Science Related Packages
dev-python/pexpect-4.8.0-r3 fails tests (MUSL)
865863 - Assigned to Python Gentoo Team
dev-python/pip-22.2.2 fails tests (MUSL)
865865 - Assigned to Python Gentoo Team
dev-python/pgspecial-2.0.1 calls commands that do not exist: locale
865867 - Assigned to Python Gentoo Team
dev-python/pycairo-1.21.0 fails tests (MUSL)
865929 - Assigned to Python Gentoo Team
dev-python/sphinxcontrib-spelling-7.6.0 fails tests (MUSL)
866049 - Assigned to Python Gentoo Team
dev-python/urllib3-1.26.12 fails tests (MUSL)
866169 - Assigned to Python Gentoo Team
dev-python/uvloop-0.16.0 fails tests (MUSL)
866173 - Assigned to Python Gentoo Team
dev-python/waitress-2.1.2 fails tests (MUSL): test_adjustments.py::TestAdjustments::test_ipv6_no_port
866175 - Assigned to Python Gentoo Team
dev-python/websockets-10.3 fails tests (MUSL)
866177 - Assigned to Gentoo Games
dev-python/frozen-flask-0.18-r1 fails tests
868702 - Assigned to Python Gentoo Team
dev-python/lxml: consider enabling threads by default (IUSE="+threads")
869734 - Assigned to Python Gentoo Team
dev-python/hatch-fancy-pypi-readme-22.6.0 fails tests: ModuleNotFoundError: No module named jsonschema
869767 - Assigned to Python Gentoo Team
dev-python/levenshtein-0.20.9 one or more CMake variables were not used by the project
871651 - Assigned to Python Gentoo Team
dev-python/jq: bundles app-misc/jq and dev-libs/oniguruma
872359 - Assigned to Zac Medico
dev-python/anyio-3.6.1 failed to rebuild with USE=doc
873220 - Assigned to Gentoo Science Related Packages
dev-lang/python-3.11[pgo] does not build without installing compiler-rt-sanitizers
873925 - Assigned to Python Gentoo Team
dev-python/weasyprint-56.1 fails tests
874288 - Assigned to Python Gentoo Team
app-eselect/eselect-python: "eselect python set N" should output a confirmation of the selected option
874618 - Assigned to Python Gentoo Team
dev-python/pylint-2.15.4 fails tests
876823 - Assigned to Python Gentoo Team
dev-python/freezegun-1.2.2 test failures: AssertionError: FakeDate(2013, 4, 9) != datetime.datetime(2013, 4, 8, 19, 0) when in an timezone negatively offset from UTC
877603 - Assigned to Python Gentoo Team
dev-python/nbconvert-7.1.0 fails tests
878461 - Assigned to Gentoo Science Related Packages
dev-lang/python-3.11.0_p1: test failures in test_posix
880131 - Assigned to Python Gentoo Team
dev-python/libsass-0.22.0 - error: invalid argument -std=gnu++<snip> not allowed with C
881339 - Assigned to Nowa Ammerlaan
dev-python/pandas-1.5.0: full-support should install dev-python/tabulate
882287 - Assigned to Python Gentoo Team
dev-python/psutil-5.9.3 fails tests: ERROR: psutil.tests.test_system.TestSensorsAPIs.test_sensors_battery: AssertionError: None is not an instance of <class 'bool'>
882767 - Assigned to Python Gentoo Team
dev-python/anyio-3.6.1 fails tests (INTERNALERROR> AttributeError: 'NonBaseMultiError' object has no attribute '_exceptions'. Did you mean: 'exceptions'?)
882771 - Assigned to Gentoo Science Related Packages
dev-python/cloudpickle-2.2.0 fails tests (TypeError: cannot pickle 'classmethod_descriptor' object)
882777 - Assigned to Python Gentoo Team
dev-python/pybind11-2.10.1[+test] - /usr/include/eigen3/Eigen/src/Core/arch/AltiVec/MatrixProduct.h:1042:9: error: subscripted value is neither array nor pointer
883937 - Assigned to Jason Zaman
dev-python/python-subunit-1.4.2 fails to compile: RuntimeError: dictionary changed size during iteration
884141 - Assigned to Python Gentoo Team
dev-python/httpx-socks-0.7.5 fails tests (MUSL-SYSTEM)
887347 - Assigned to Python Gentoo Team
dev-python/tiny-proxy-0.1.1 fails tests (hang)
887349 - Assigned to Python Gentoo Team
dev-python/apipkg-3.0.1 fails tests (DASH-SYSTEM)
887849 - Assigned to Python Gentoo Team
dev-python/dirty-equals-0.5.0 fails tests with pypy3 7.3.10 (?)
887859 - Assigned to Python Gentoo Team
dev-python/elementpath-3.0.2 fails tests (DASH-SYSTEM): Error: unsupported locale setting
887935 - Assigned to Python Gentoo Team
dev-python/ijson-3.2.0_p0 fails tests
889710 - Assigned to Python Gentoo Team
dev-python/logbook-1.5.3-r1 fails to compile (USR-MERGE-SYSTEM): An error happened in rendering the page base
890407 - Assigned to Andreas Zuber
dev-python/django-4.1.4 fails tests test_pass_connection_between_threads and test_thread_sharing_count
890829 - Assigned to Python Gentoo Team
dev-python/flask-babel-4.0.0 fails to compile: no theme named furo found (missing theme.conf?)
891037 - Assigned to Python Gentoo Team
dev-python/pytest-7.2.0 fails tests
891131 - Assigned to Python Gentoo Team
dev-python/emcee-3.1.3 fails tests (LIBARCHIVE-SYSTEM): test_longdouble.py::test_longdouble_actually_needed[TempHDFBackend] Fatal Python error: Aborted
892215 - Assigned to Gentoo Science Related Packages
dev-python/meshio-5.3.4 fails tests (LIBARCHIVE-SYSTEM): test_moab.py::test_io[mesh0] Fatal Python error: Aborted
892219 - Assigned to Python Gentoo Team
dev-python/amqp-5.1.1-r1 fails to compile (LIBARCHIVE-SYSTEM): TypeError: not all arguments converted during string formatting
892259 - Assigned to Python Gentoo Team
dev-python/netcdf4-1.5.8 fails tests (LIBARCHIVE-SYSTEM): python3.9: H5CS.c:224: H5CS_pop: Assertion fstack->nused > 0 failed
892265 - Assigned to Gentoo Science Related Packages
dev-python/pytest-trio-0.8.0-r1 fails to compile (LIBARCHIVE-SYSTEM): Reason: UndefinedError("logo is undefined")
892349 - Assigned to Nowa Ammerlaan
dev-python/discid-1.2.0-r1 fails to compile (LIBARCHIVE-SYSTEM): TypeError: not all arguments converted during string formatting
892351 - Assigned to Python Gentoo Team
dev-python/pytidylib-0.3.2-r2 fails tests (LIBARCHIVE-SYSTEM): test_docs.py::TestDocs1::test_alt_added_to_img Fatal Python error: Aborted
892383 - Assigned to Python Gentoo Team
dev-python/plotly-5.15.0 installs files with broken symlink
892561 - Assigned to Gentoo Science Related Packages
dev-python/sh-1.14.3 fails tests (LIBARCHIVE-SYSTEM): ERROR: test_piped_exception2 (__main__.FunctionalTests)
892605 - Assigned to Patrick McLean
dev-python/sphinx-notfound-page-0.8.3 fails tests (LIBARCHIVE-SYSTEM)
892609 - Assigned to Python Gentoo Team
dev-python/tornado-6.2-r1 fails to compile (LIBARCHIVE-SYSTEM): TypeError: Python directive method get_signature_prefix() must return a list of nodes. Return value was coroutine
892619 - Assigned to Python Gentoo Team
dev-python/yarl-1.8.2 fails tests (LIBARCHIVE-SYSTEM): FAILED test_url_parsing.py::TestScheme::test_not_a_scheme2 - AssertionError: ..
892621 - Assigned to Zac Medico
dev-python/myst-parser requires <dev-python/sphinx-5.2
892720 - Assigned to Python Gentoo Team
dev-python/jupyter-client-8.0.2 fails tests (HARDENED-SYSTEM): RuntimeError: Kernel died before replying to kernel_info
893810 - Assigned to Gentoo Science Related Packages
dev-python/jupyter-server-2.2.1 fails tests (HARDENED-SYSTEM): BufferError: Existing exports of data: object cannot be re-sized
893812 - Assigned to Gentoo Science Related Packages
dev-python/kombu-5.3.0_beta2 fails to compile (HARDENED-SYSTEM): error in kombu setup command: tests_require must be a string or list of strings containing valid version requirement specifiers; Expected end or semicolon (after name and no valid version s
893814 - Assigned to Python Gentoo Team
dev-python/openstacksdk-1.0.1 fails tests: json.decoder.JSONDecodeError: Expecting value: line 1 column 1 (char 0)
894280 - Assigned to Matthew Thode ( prometheanfire )
=dev-python/pip-23.0 fails to install packages with "--user"
895410 - Assigned to Python Gentoo Team
dev-python/starlette-0.25.0 fails tests: "RuntimeError: There is no current event loop in thread 'MainThread'."
895488 - Assigned to Python Gentoo Team
dev-python/tagpy-2022.1 fails to compile (MUSL-CLANG-SYSTEM): id3.cpp:268:43: error: reference to optional is ambiguous
895514 - Assigned to Python Gentoo Team
dev-python/pip pip3 un-documented --user flag
896434 - Assigned to Python Gentoo Team
dev-python/scripttest-1.3.0-r2 fails to compile (GCC-13-SYSTEM): RuntimeError: dictionary changed size during iteration
897922 - Assigned to Python Gentoo Team
dev-python/pyrate-limiter-2.10.0 fails tests: FAILED test_context_decorator.py::test_ratelimit__delay_synchronous[monotonic1]
898140 - Assigned to Nowa Ammerlaan
dev-python/ubelt: bundles a ton of libraries
898514 - Assigned to Gentoo Science Related Packages
dev-python/olefile-0.46-r2 fails to compile (HARDENED-SYSTEM): RuntimeError: dictionary changed size during iteration
898524 - Assigned to Python Gentoo Team
dev-python/numpy-1.24.2 fails to compile on s390 & ia64
900751 - Assigned to Gentoo Science Related Packages
dev-python/pyscreenshot-3.1 fails tests
901113 - Assigned to Python Gentoo Team
dev-python/pygame-2.5.2-r1 calls cc directly
901273 - Assigned to Python Gentoo Team
dev-python/trio-0.22.0-r1 failed to emerge
901401 - Assigned to Nowa Ammerlaan
dev-python/pytest-qt-4.2.0 fails tests
901999 - Assigned to Nowa Ammerlaan
dev-python/flask-babel-3.0.1-r2 fails tests
903899 - Assigned to Python Gentoo Team
dev-python/pytest-7.2.2 fails TestInvocationVariants.test_cmdline_python_namespace_package
903909 - Assigned to Python Gentoo Team
dev-python/pygame-2.2.0: test phase aborts
903974 - Assigned to Python Gentoo Team
dev-python/rich-13.3.4 fails tests
904274 - Assigned to Python Gentoo Team
dev-python/pyspelling-2.8.2: fails tests
904297 - Assigned to Python Gentoo Team
dev-python/nox-2023.04.22 fails tests: pypy3: error: Can not specify both --no-color and --force-color
904948 - Assigned to Python Gentoo Team
dev-python/pexpect-4.8.0-r3 fails test TestCaseEnv::test_spawn_uses_env
905647 - Assigned to Python Gentoo Team
dev-python/lmdb-1.4.1 fails to compile: UndefinedError("'style' is undefined")
905735 - Assigned to Python Gentoo Team
dev-python/statsmodels-0.13.5 fails tests
905736 - Assigned to Python Gentoo Team
dev-python/pulsectl: requires media-sound/pulseaudio-daemon for testing
905790 - Assigned to Louis Sautier (sbraz)
dev-python/osc-lib-2.8.0 fails tests
906052 - Assigned to Matthew Thode ( prometheanfire )
dev-python/keystoneauth1-5.2.0 fails tests: AttributeError: MockHTTPResponse object has no attribute close
906661 - Assigned to Matthew Thode ( prometheanfire )
dev-python/autopage-0.5.1 fails tests (MUSL-SYSTEM): AssertionError: 0 != 11
906696 - Assigned to Python Gentoo Team
dev-python/click-8.1.3 fails tests (MUSL-SYSTEM)
906697 - Assigned to Python Gentoo Team
dev-python/httpbin-0.7.0-r5 fails tests (MUSL-SYSTEM): test_digest_auth - test_digest_auth_wrong_pass
906721 - Assigned to Python Gentoo Team
dev-python/jsonpickle-3.0.1 fails tests (MUSL-SYSTEM): pandas_test.py::test_dataframe_roundtrip
906722 - Assigned to Python Gentoo Team
dev-python/myst-parser-1.0.0 fails tests (MUSL-SYSTEM)
906724 - Assigned to Python Gentoo Team
dev-python/podman-4.5.0 fails tests (MUSL-SYSTEM): test_network.py::NetworkTestCase::test_remove
906778 - Assigned to Zac Medico
dev-python/amqp-5.1.1-r1 fails to compile (MUSL-SYSTEM): Could not import extension sphinx_celery.apicheck (exception: No module named 'six')
906780 - Assigned to Python Gentoo Team
dev-python/pyamg-5.0.0 fails tests (MUSL-SYSTEM): test_air.py::TestAIR::test_upwind_advection <- test_air.py Fatal Python error: Aborted
906781 - Assigned to Gentoo Science Related Packages
dev-python/pyparted-3.12.0 fails tests (MUSL-SYSTEM): FAIL: runTest (tests.test__ped_disktype.DiskTypeStrTestCase)
906783 - Assigned to Michał Górny
dev-python/pytest-httpserver-1.0.7 fails tests (MUSL-SYSTEM)
906833 - Assigned to Python Gentoo Team
dev-python/requests-cache-1.0.1 fails tests (MUSL-SYSTEM)
906837 - Assigned to Jason A. Donenfeld
dev-python/requests-unixsocket-0.3.0-r2 fails tests (MUSL-SYSTEM)
906838 - Assigned to Python Gentoo Team
dev-python/responses-0.23.1-r1 fails tests (MUSL-SYSTEM)
906839 - Assigned to Python Gentoo Team
dev-python/sphinxcontrib-bibtex-2.5.0 fails tests (MUSL-SYSTEM)
906841 - Assigned to Nowa Ammerlaan
dev-python/tasklib-2.5.1 fails tests (MUSL-SYSTEM): ModuleNotFoundError: No module named tzdata
906842 - Assigned to Matt Turner
dev-python/tzlocal-5.0.1 fails tests (MUSL-SYSTEM)
906845 - Assigned to Python Gentoo Team
dev-python/ubelt-1.2.4 fails tests (MUSL-SYSTEM)
906846 - Assigned to Gentoo Science Related Packages
dev-python/distlib-0.3.6 fails tests: FAIL: test_custom_shebang (test_scripts.ScriptTestCase)
907070 - Assigned to Python Gentoo Team
dev-python/numpy-1.24.2: tests TestUfunc::test_identityless_reduction_huge_array and TestKind::test_all fail
907228 - Assigned to Gentoo Science Related Packages
dev-python/pyrsistent-0.19.3 fails tests
907257 - Assigned to Python Gentoo Team
dev-python/virtualenv-20.23.0 fails tests (hang)
907289 - Assigned to Python Gentoo Team
dev-python/pytest-aiohttp-1.0.4 fails tests
908812 - Assigned to Python Gentoo Team
dev-python/asteval-0.9.30 fails tests: AssertionError: ImportError != None
908825 - Assigned to Pacho Ramos
dev-python/yarl-1.9.2 fails tests
909553 - Assigned to Python Gentoo Team
dev-python/websockets-11.0.3-r1 fails tests if sys-apps/pkgcore is not installed
909567 - Assigned to Python Gentoo Team
dev-python/pysnmp: pysnmp 4.4.12 requires pycryptodomex, which is not installed.
910076 - Assigned to Gentoo Netmon project
dev-python/polib-1.2.0 fails tests with >=sys-devel/gettext-0.22
910477 - Assigned to Python Gentoo Team
dev-python/mss-9.0.1 fails tests (hang)
910722 - Assigned to Python Gentoo Team
dev-python/pbr-5.11.1 requires <dev-python/sphinx-7
911134 - Assigned to Matthew Thode ( prometheanfire )
dev-python/twisted: blocks on old dev-python/priority
911136 - Assigned to Python Gentoo Team
dev-python/indexed-gzip-1.8.3 installs more files with FEATURES=test
911247 - Assigned to Python Gentoo Team
dev-python/pandas-1.5.3: fails TestDataFramePlots::test_plain_axes test with matplotlib-3.7.0
911622 - Assigned to Gentoo Science Related Packages
dev-python/zeroconf-0.72.0 - AttributeError: CAnalysedBaseTypeNode object has no attribute name
911644 - Assigned to Python Gentoo Team
dev-lang/python incomplete LICENSE information
911861 - Assigned to Python Gentoo Team
dev-python/mypy-1.5.0 fails tests
912057 - Assigned to Python Gentoo Team
dev-python/paste-3.5.3 fails tests (GLIBC-2.38-SYSTEM): collecting .. Fatal Python error: Segmentation fault
912067 - Assigned to Python Gentoo Team
dev-python/radon-6.0.1 - Reason: ThemeError(Local asset file paths must not contain query strings: _static/MathJax.js?config=TeX-A
912694 - Assigned to Python Gentoo Team
dev-python/pip-23.2.1 fails tests
912717 - Assigned to Python Gentoo Team
dev-python/watchfiles-0.21.0-r1 fails tests (hang)
913002 - Assigned to Python Gentoo Team
dev-python/pybind11-2.12.0: fails tests on hppa
913021 - Assigned to Jason Zaman
dev-python/pip-23.2.1: fails TestDiagnosticPipErrorPresentation_ASCII::test_complete_color, TestDiagnosticPipErrorPresentation_Unicode::test_complete_color tests
913022 - Assigned to Python Gentoo Team
dev-python/selenium-4.12.0: "Unable to obtain driver for firefox using Selenium Manager"
913889 - Assigned to Python Gentoo Team
dev-lang/python: installs Makefile at /usr/lib/python3.11/config-3.11-${CHOST}/Makefile with INSTALL path hardcoded (possibly including Portage tmpdir if upgraded itself)
913919 - Assigned to Python Gentoo Team
dev-python/meson-python-0.14.0: failed (compile phase): error: Could not find ninja version 1.8.2 or newer.
913950 - Assigned to Python Gentoo Team
dev-python/python-subunit-1.4.4 fails to compile with dev-lang/python-exec[-native-symlinks]
914373 - Assigned to Python Gentoo Team
dev-lang/python-3.11.5 does not respect LDFLAGS for _bootstrap_python
914430 - Assigned to Python Gentoo Team
dev-python/notebook: unbundle mathjax-3.x?
914447 - Assigned to Gentoo Science Related Packages
dev-python/flake8-7.0.0 - Could not import extension sphinx-prompt (exception: No module named sphinx-prompt)
914554 - Assigned to Python Gentoo Team
dev-python/psycopg-3.1.10: test_connect_timeout[asyncio] and test_ctrl_c_handler fail
914560 - Assigned to Python Gentoo Team
dev-python/pikepdf-8.4.1 fails tests
915396 - Assigned to Andrey Grozin
dev-python/jupyter-lsp-2.2.0 fails tests
915987 - Assigned to Gentoo Science Related Packages
>=dev-python/mypy-1.6.0: Sandbox violation if MYPY_CACHE_DIR is set
916299 - Assigned to Python Gentoo Team
dev-python/pandas-2.1.2: fails tests on big endian
916502 - Assigned to Gentoo Science Related Packages
dev-python/mypy-1.14.0 [native-extensions]: sets -Werror and forces -O3
916577 - Assigned to Python Gentoo Team
dev-python/scikit-learn-1.3.2-r1 - sklearn/.../_dist_metrics.c: error: passing argument 1 of _pyx_f_7sklearn_7metrics_13_dist_metrics_19EuclideanDistanc
919261 - Assigned to Gentoo Science Related Packages
dev-python/apsw-3.44.2.0: hangs on emerge
920953 - Assigned to Python Gentoo Team
dev-python/cloudpickle-3.0.0 fails test test_recursion_during_pickling Fatal Python error: Segmentation fault
921265 - Assigned to Python Gentoo Team
dev-python/pysnmp-4.4.12-r2 installs deprecated .egg/.egg-info (GCC-14-SYSTEM)
921689 - Assigned to Gentoo Netmon project
dev-python/psutil-5.9.6: fails tests: FAIL: psutil.tests.test_posix.TestProcess.test_nice: AssertionError: '-' != 19
921957 - Assigned to Python Gentoo Team
dev-python/networkx-3.2.1: fails test_traveling_salesman.py::test_asadpour_tsp test
921958 - Assigned to Python Gentoo Team
dev-python/numpy-1.26.2: fails TestKind::test_int test
921960 - Assigned to Gentoo Science Related Packages
dev-python/mypy-1.7.1 fails tests: mypy/test/teststubtest.py::StubtestUnit::test_runtime_typing_objects - AssertionError: test_module.Y.__mutable_keys__
922514 - Assigned to Python Gentoo Team
dev-python/pyamg-5.0.1: tests hang on x86
922739 - Assigned to Gentoo Science Related Packages
dev-python/levenshtein-0.23.0 pull in conflicting versions of dev-cpp/rapidfuzz-cpp
922927 - Assigned to Python Gentoo Team
dev-python/hvac-2.1.0 fails tests: __main__.py: error: unrecognized arguments: --dist worksteal
923047 - Assigned to William Hubbs
dev-python/jinja2-3.1.3 fails tests: AssertionError: assert just a small example link to a webpage == just a small example link to a webpage
923051 - Assigned to Python Gentoo Team
dev-python/jq-1.6.0-r1 fails tests: ValueError: parse error: Invalid string: control characters from U+0000 through U+001F must be escaped at line 1, column 5
923052 - Assigned to Zac Medico
dev-python/numpydoc-1.6.0 fails tests: AssertionError: assert {1: [EX01, SA01]} == {2: [EX01]}
923073 - Assigned to Python Gentoo Team
dev-python/pgspecial-2.1.1 fails tests: AssertionError: assert [None, [(public, postgres), (schema1, postgres), (schema2, postgres), (schema3, postgres)], [Name, Owner], SELECT 4] == [None, [(public, pg_database_owner), (schema1, postgres), (schema2, pos
923076 - Assigned to Python Gentoo Team
dev-python/poetry-1.7.1 fails tests: assert 0 == 1
923078 - Assigned to Python Gentoo Team
dev-python/pydot-2.0.0 fails tests: AssertionError: "dot" with args [-Tjpe, tmpf68z0w11] returned code: 1
923133 - Assigned to Python Gentoo Team
dev-python/pyenchant-3.2.2-r1 fails tests: test_broker.py::test_prov_ordering Fatal Python error: Segmentation fault
923134 - Assigned to Python Gentoo Team
dev-python/pytest-mpl-0.16.1 fails tests: except ImportError:
923141 - Assigned to Python Gentoo Team
dev-python/pytest-xdist-3.5.0 fails tests: AssertionError: assert 1 == 0
923219 - Assigned to Python Gentoo Team
dev-python/ansible-compat-4.1.11 fails tests: FAILED test_runtime.py::test_install_galaxy_role_unlink - FileExistsError: [Errno 17] File exists: null -> acme.ge..
923632 - Assigned to Python Gentoo Team
dev-python/cheroot-10.0.0 fails tests: AssertionError: assert wrong version number in [SSL] record layer failure
923790 - Assigned to Python Gentoo Team
dev-python/contourpy-1.2.0 fails tests: test_filled.py::test_filled_z_nonfinite[nan1-inf-inf-mpl2014] Fatal Python error: Aborted
923791 - Assigned to Python Gentoo Team
dev-python/cryptography-41.0.7 fails 12 tests
923795 - Assigned to Python Gentoo Team
dev-python/pyftpdlib-1.5.9 fails tests
923895 - Assigned to Python Gentoo Team
dev-python/pandas-2.2.0-r1 fails tests: pandas/tests/frame/test_arrow_interface.py::test_dataframe_to_arrow - AttributeError: 'pyarrow.lib.RecordBatchReader' object has no attribute 'equals'
923967 - Assigned to Gentoo Science Related Packages
dev-python/pyarrow-15.0.0 fails to configure on sparc: CMake Error at cmake_modules/SetupCxxFlags.cmake:42 (message): Unknown system processor
923968 - Assigned to Tupone Alfredo
dev-python/sympy-1.12-r1 fails tests: Fatal Python error: Segmentation fault
924016 - Assigned to Andrey Grozin
dev-python/cython-3.0.8 fails tests on x86: AssertionError: Failed doctest test for cpp_stl_any.cast_test
924027 - Assigned to Python Gentoo Team
dev-python/typing-extensions-4.9.0 fails tests: AssertionError: Items in the first set but not the second:
924040 - Assigned to Python Gentoo Team
dev-python/vcrpy-6.0.1 fails tests
924042 - Assigned to Python Gentoo Team
dev-python/wurlitzer-3.1.0 fails tests: test.py::test_pipes Fatal Python error: Aborted
924043 - Assigned to Nowa Ammerlaan
dev-python/tables-3.9.2: undefined symbol register_blosc2
924223 - Assigned to Python Gentoo Team
dev-python/bitarray-2.9.2 fails tests: MemoryError
924280 - Assigned to Gentoo Science Related Packages
dev-python/exceptiongroup-1.2.0 fails tests: AssertionError: RecursionError not raised
924334 - Assigned to Python Gentoo Team
dev-python/argh-0.31.2 fails tests: collecting .. Fatal Python error: Segmentation fault
924753 - Assigned to Python Gentoo Team
dev-python/bottleneck-1.3.7 fails tests: FAILED memory_test.py::test_memory_leak - assert 983040 == 0
924863 - Assigned to Gentoo Science Mathematics related packages
app-text/htmlmin-0.1.12-r1 fails tests: RuntimeError: dictionary changed size during iteration
924968 - Assigned to Python Gentoo Team
dev-python/scikit-learn-1.3.2-r1 fails tests
924973 - Assigned to Gentoo Science Related Packages
dev-python/a2wsgi-1.10.1 fails tests (hang)
925066 - Assigned to Python Gentoo Team
dev-python/django-5.1.5 problems with installed bash completions
925263 - Assigned to Python Gentoo Team
dev-python/mypy-1.8.0: install change log
925500 - Assigned to Python Gentoo Team
dev-python/parsedatetime-2.6-r1 fails tests: FAILED TestSimpleOffsets.py::test::testNextMonth - AssertionError: Tuples differ: ((2026, 2, 28, 22, 18, 0, 0, 0, 0), 1) != ((..
925854 - Assigned to Python Gentoo Team
dev-python/pybind11-2.11.1 fails to compile: tensor.h:156:31: error: invalid conversion from const pybind11::ssize_t {aka const long int} to const int [-fpermissive]
925856 - Assigned to Jason Zaman
dev-python/python-mpd2-3.1.1 fails tests: AssertionError: Mock got idle "database"
925875 - Assigned to Python Gentoo Team
dev-python/tagpy-2022.1 fails tests: test_deb-bug-438556.py::test_deb_bug_438556 Fatal Python error: Aborted
925916 - Assigned to Python Gentoo Team
dev-python/textdistance-4.6.1 fails tests: test_common.py::test_simmetry[alg2] Fatal Python error: Aborted
925917 - Assigned to Nowa Ammerlaan
dev-python/trio-0.24.0 fails tests: FAILED test_threads.py::test_run_in_worker_thread - AssertionError: Regex pattern did not match
925925 - Assigned to Nowa Ammerlaan
dev-python/yapf-0.40.2 fails tests: AssertionError: Traceback (most recent call last):
925935 - Assigned to Python Gentoo Team
dev-python/aws-xray-sdk-2.13.0 fails tests: FAILED test_sqlalchemy_core_2.py::test_orm_style_select_execution - assert 0 == 1
926306 - Assigned to Zac Medico
dev-python/numpy-1.26.4 fails to compile: array_method.c:809:44: error: passing argument 3 of strided_loop from incompatible pointer type [-Wincompatible-pointer-types]
926469 - Assigned to Gentoo Science Related Packages
dev-python/kombu-5.3.5 fails tests: TypeError: LockError.__init__() missing 1 required positional argument: message
926492 - Assigned to Python Gentoo Team
dev-python/python-distutils-extra-2.47 fails tests
926631 - Assigned to Python Gentoo Team
dev-python/twine-5.0.0 fails tests: FAILED test_package.py::test_pkginfo_returns_no_metadata[unsupported Metadata-Version] - Failed: DID NOT RAISE <class twine.exceptions.InvalidDistribution>
926758 - Assigned to Python Gentoo Team
dev-python/superqt-0.6.2 fails tests: test_color_combo.py::test_q_color_combobox Fatal Python error: Aborted
927056 - Assigned to Nowa Ammerlaan
dev-python/scikit-learn-1.3.2-r1 fails tests
927351 - Assigned to Gentoo Science Related Packages
dev-python/aiosmtpd-1.4.5 fails tests
927352 - Assigned to Python Gentoo Team
dev-python/cysignals-1.11.4: segmentation fault in tests
927915 - Assigned to Michael Orlitzky
dev-python/cryptography-42.0.5 crashes on loong when built with dev-lang/rust
928333 - Assigned to Gentoo Rust Project
dev-python/asgiref-3.8.1 fails tests: FAILED test_sync.py::test_inner_shield_sync_and_async_middleware - assert not True
928356 - Assigned to Python Gentoo Team
dev-python/openpyxl-3.1.2 fails tests: FAILED test_drawing.py::TestDrawing::test_ctor - AttributeError: TestDrawing object has no attribute drawing
928484 - Assigned to Python Gentoo Team
dev-python/pulsectl-asyncio-1.3.2 fails tests: FAILED test_async_with_dummy_instance.py::AsyncDummyTests::test_get_peak_sample - AssertionError: 0.0 not greater than 0
928510 - Assigned to Python Gentoo Team
dev-python/pyopengl-3.1.7-r1 fails tests: test_core.py::TestCore::test_arbwindowpos Fatal Python error: Aborted
928561 - Assigned to Python Gentoo Team
dev-python/python-glanceclient-4.5.0 fails tests: ERROR: test_download_has_no_stray_output_to_stdout (test_shell.ShellTestRequests)
928564 - Assigned to Matthew Thode ( prometheanfire )
dev-python/jedi-0.19.1: tests fail when running portage using pypy3
928660 - Assigned to Python Gentoo Team
dev-python/psutil-5.9.8: Fails test test_posix.TestSystemAPIs.test_disk_usage: AssertionError: 1898898468864 != 16709320704 within 4194304 delta (1882189148160 difference)
928663 - Assigned to Python Gentoo Team
dev-python/pytest-7.4.4: Fails test test_unhandled_thread_exception_warning_error
928732 - Assigned to Python Gentoo Team
dev-python/pdm-2.13.3 fails tests: FAILED test_project.py::test_project_packages_path - AssertionError: assert 3.12 == 3.10
928964 - Assigned to Python Gentoo Team
dev-python/deepdiff-7.0.1 fails tests: FAILED test_delta.py::TestDeltaCompareFunc::test_list_of_alphabet_and_its_delta - TypeError: deepdiff.helper.Opcode() argument after must be a mapping, no..
928984 - Assigned to Python Gentoo Team
dev-python/dbus-next-0.2.3-r1 fails tests: FAILED test_fd_passing.py::test_sending_file_descriptor_low_level - OSError: [Errno 9] Bad file descriptor
930017 - Assigned to Python Gentoo Team
dev-python/tldextract-5.1.2 fails test tests/test_parallel.py::test_cache_cleared_by_other_process
930121 - Assigned to Patrick Lauer
dev-python/tavern: blocks on <dev-python/paho-mqtt-2
930325 - Assigned to Matt Jolly
dev-python/python-mpv-1.0.5 fails tests: FAILED test_mpv.py::TestProperties::test_option_read - ValueError: (Invalid value for mpv parameter, -4, (<MpvHandle object at 0..
930358 - Assigned to Nowa Ammerlaan
dev-python/python-novaclient-18.6.0 fails tests: ValueError: too many values to unpack (expected 3)
930359 - Assigned to Matthew Thode ( prometheanfire )
dev-python/sqlparse-0.5.0 fails tests: FAILED test_regressions.py::test_max_recursion - TypeError: couldnt record exception context for exception RecursionError..
930383 - Assigned to Python Gentoo Team
dev-python/nuitka-2.2 fails tests: +<artificial>:(.text+0xa803): undefined reference to constant_bin_data
931232 - Assigned to OzTiram
dev-python/argcomplete-3.3.0 fails tests: AssertionError
931234 - Assigned to Python Gentoo Team
dev-python/pybind11-2.12.0 fails tests: FAILED test_factory_constructors.py::test_reallocation_b - assert --- actual / +++ expected
931335 - Assigned to Jason Zaman
dev-python/pymdown-extensions-10.8.1 fails tests: FAILED test_highlight.py::TestHighlightGuess::test_guess - AssertionError: False is not true
931345 - Assigned to Nowa Ammerlaan
dev-python/pymongo-4.7.1 fails tests: FAILED test_connection_logging.py::TestConnectionLoggingConnectionPoolOptions::test_waitQueueTimeoutMS_should_be_included_in_connection_pool_created_message_when_specified - AssertionError: 2 != 1
931346 - Assigned to Python Gentoo Team
dev-python/sphinx-rtd-theme-2.0.0 fails tests: FAILED test_builders.py::test_basic
931566 - Assigned to Python Gentoo Team
dev-python/sphinxcontrib-programoutput-0.17-r1 fails tests: FAILED test_directive.py::TestDirective::test_shell_with_unexpected_return_code - AssertionError: Unexpected return code 1 from command not found in directive deprecated is already registered, i
931574 - Assigned to Python Gentoo Team
dev-python/psycopg-3.1.19 fails tests: test_copy_async.py::test_copy_out_error_with_copy_finished[asyncio] Fatal Python error: Aborted
931740 - Assigned to Python Gentoo Team
dev-python/libcst-1.3.1 fails tests: FAILED test_codemod_cli.py::TestCodemodCLI::test_codemod_formatter_error_input - AssertionError
931848 - Assigned to Python Gentoo Team
dev-python/pexpect-4.9.0 fails tests (hang)
931969 - Assigned to Python Gentoo Team
dev-python/psutil-5.9.8 fails tests: FAIL: psutil.tests.test_contracts.TestAvailProcessAPIs.test_memory_maps: AssertionError: False != True
931984 - Assigned to Python Gentoo Team
dev-python/setuptools-scm-8.1.0 fails tests: FAILED test_git.py::test_git_getdate - AssertionError: assert datetime.date(2024, 5, 16) == datetime.date(2024, 5, 15)
931986 - Assigned to Python Gentoo Team
dev-python/pyenchant-3.3.0 fails tests: FAILED test_broker.py::test_all_langs_are_available - AssertionError: language fr-1990 advertised but non-existent
932305 - Assigned to Python Gentoo Team
dev-python/iminuit-2.25.2 fails to compile: new_allocator.h:172:33: error: void operator delete(void, std::size_t) called on pointer <unknown> with nonzero offset [1, 576460752303423489] [-Werror=free-nonheap-object]
932357 - Assigned to Andrey Grozin
dev-python/paho-mqtt-2.1.0 fails tests: ERROR test_01_no_clean_session.py::test_01_no_clean_session - RuntimeError: Client 01-no-clean-session.py exited with code -2, expected 0
932446 - Assigned to Matt Turner
dev-python/regress-0.4.5 does not respect LDFLAGS
932708 - Assigned to Patrick McLean
dev-python/regress-0.4.5 does not respect CFLAGS
932709 - Assigned to Patrick McLean
dev-python/aiosmtpd-1.4.6 fails tests on hppa: assert has_smtps is True
933077 - Assigned to Python Gentoo Team
dev-python/pytest-subprocess-1.5.0 fails tests
933098 - Assigned to Python Gentoo Team
dev-lang/pypy: wire up PGO
933396 - Assigned to Python Gentoo Team
dev-python/iminuit-2.33.0 adds -Werror flag on its own
933512 - Assigned to Andrey Grozin
dev-python/wxpython-4.2.1-r2 fails tests: FAILED test_lib_floatcanvas_bbox.py::testAsBBox::testPassArray2
934490 - Assigned to Gentoo wxWidgets project
dev-python/tifffile-2024.6.18 fails tests: FAILED test_tifffile.py::test_write_datetime_tag[None] - AssertionError: assert DateTime not in <tifffile.TiffTags @0x000078D1FA13CA60>
934551 - Assigned to Python Gentoo Team
dev-python/pluggy-1.5.0 lacks dependency on dev-python/semantic-version
934570 - Assigned to Python Gentoo Team
dev-python/pandas-2.2.2-r1 fails tests: AssertionError: Attributes of DataFrame.iloc[:, 7] (column name="h") are different
934575 - Assigned to Gentoo Science Related Packages
dev-python/sympy is masked on ppc64 23.0 profile but message suggests it should not be
934761 - Assigned to matoro
dev-python/pillow-10.3.0 fails to compile
934777 - Assigned to Python Gentoo Team
>=dev-python/pikepdf-9.0.0 fails to compile
934925 - Assigned to Andrey Grozin
dev-python/requests-cache-1.2.0 fails test: tests/compat/test_responses_load_cache.py::test_mock_session
934926 - Assigned to Jason A. Donenfeld
dev-python/urllib3-2.2.2 fails tests on mips: 44 failed, 2 errors
935248 - Assigned to Python Gentoo Team
dev-python/pip-24.1.1 fails tests on ppc, loong: SSLError(SSLCertVerificationError(1, '[SSL: CERTIFICATE_VERIFY_FAILED] certificate verify failed: self-signed certificate (_ssl.c:1004)'))
935433 - Assigned to Python Gentoo Team
dev-python/cheroot-10.0.1 fails tests on mips: SSLError(SSLError(1, '[SSL: TLSV1_ALERT_INTERNAL_ERROR] tlsv1 alert internal error (_ssl.c:2563)'))
935502 - Assigned to Python Gentoo Team
dev-python/pytest-reraise-2.1.2 fails tests: FAILED test_multiple_exceptions.py::test_reraise_first - assert False
935622 - Assigned to Python Gentoo Team
dev-python/pytest-xprocess-1.0.2 fails tests with "Connection refused"
935670 - Assigned to Python Gentoo Team
dev-python/agate-1.11.0: fails test tests/test_py3.py::TestSniffer::test_sniffer
935682 - Assigned to Zac Medico
dev-python/django-configurations-2.5.1 fails test test_database_url_value
935773 - Assigned to Python Gentoo Team
dev-python/loky-3.4.1 fails tests: FAILED test_resource_tracker.py::TestResourceTracker::test_resource_tracker_sigkill - assert 2 == 1
935878 - Assigned to Python Gentoo Team
dev-python/dns-lexicon-3.17.0 fails tests: FAILED test_client.py::test_client_init_when_missing_action_should_fail - lexicon.exceptions.ProviderNotAvailableError: This provider (fakeprovider) is not supported by Lexicon
935884 - Assigned to Patrick Lauer
dev-python/easy-thumbnails-2.8.5 fails tests: AssertionError: 2 != 4
935885 - Assigned to Python Gentoo Team
dev-python/flaky-3.8.1 fails tests: FAILED test_pytest_example.py::TestExampleFlakyTestCase::test_flaky_thing_that_fails_then_succeeds - AssertionError
935886 - Assigned to Python Gentoo Team
dev-python/hatchling-1.25.0 fails tests: FAILED test_wheel.py::TestBuildStandard::test_default_build_script_known_artifacts - AssertionError: assert my_app-0.0.1-cp310-cp310-linux_x86_64.whl == my_app-0.0.1-cp310-cp310-musllinux_1_2_x86_64.whl
935896 - Assigned to Python Gentoo Team
dev-python/peewee-3.17.7 calls commands that do not exist: locale
935920 - Assigned to Python Gentoo Team
dev-python/requests-unixsocket-0.3.0-r4 fails tests: "requests.exceptions.InvalidURL: Not supported URL scheme http+unix"
936014 - Assigned to Python Gentoo Team
dev-python/cheroot-10.0.1 fails tests: "requests.exceptions.InvalidURL: Not supported URL scheme http+unix"
936015 - Assigned to Python Gentoo Team
dev-python/xmlschema-3.3.1 fails tests: AssertionError: test.xsd != test.xsd
936087 - Assigned to Python Gentoo Team
dev-python/pip-24.0 fails test when /tmp/test exists
936321 - Assigned to Python Gentoo Team
dev-util/yamllint-1.35.1 fails tests: FAILED test_key_ordering.py::KeyOrderingTestCase::test_locale_accents - AssertionError: Lists differ: [4:1: wrong ordering of key hais in mapping (key-ordering)] != []
936396 - Assigned to No maintainer - Look at https://wiki.gentoo.org/wiki/Project:Proxy_Maintainers if you want to take care of it
dev-python/numexpr-2.10.1 QA Notice: setuptools warnings detected:
936895 - Assigned to Python Gentoo Team
dev-lang/python-3.12.4_p3 - [ncurses-6.5] [icu-75.1] [gcc-15] sandbox issue
937223 - Assigned to Python Gentoo Team
dev-python/beartype-0.18.5 fails to compile: FAILED test_pep561_static.py::test_pep561_mypy - subprocess.CalledProcessError: Command python3.10, -m, mypy, --config-file, mypy.ini, beartype) returned non-zero exit status 1
937575 - Assigned to Python Gentoo Team
dev-python/breathe-4.35.0-r1 fails tests: FAILED test_renderer.py::test_render_func - TypeError: expected string or bytes-like object
937576 - Assigned to Python Gentoo Team
dev-python/capturer-3.0-r1 fails tests (hang)
937577 - Assigned to Python Gentoo Team
dev-python/django-polymorphic-3.1-r1 fails tests
937606 - Assigned to Python Gentoo Team
dev-python/executing-2.0.2_pre20240626 fails tests: FAILED test_main.py::TestStuff::test_iter - executing._exceptions.VerifierFailure: ast.Call is not created from GET_ITER
937607 - Assigned to Python Gentoo Team
dev-python/keyrings-alt-5.0.1 fails tests: FAILED test_crypto.py::TestCryptedFileKeyring::test_empty_username - ValueError: Username cannot be blank
937623 - Assigned to Python Gentoo Team
dev-python/selenium-4.23.1 QA Notice: setuptools warnings detected
937706 - Assigned to Python Gentoo Team
dev-python/numpy-2.0.0 fails src_compile on ppc64 power9
937757 - Assigned to Gentoo Science Related Packages
dev-python/pyproject-api-1.7.1 fails tests: FAILED test_frontend_setuptools.py::test_setuptools_prepare_metadata_for_build_wheel - AssertionError: assert [magic>3, requests>2] == [magic >3, requests >2]
937803 - Assigned to Python Gentoo Team
dev-python/textx-4.0.1 fails tests: FAILED test_scoping_tools.py::test_textx_tools_with_frozen_classes1 - RecursionError: maximum recursion depth exceeded in comparison
937804 - Assigned to Zac Medico
dev-python/vdirsyncer-0.19.2-r2 fails tests: FAILED test_vobject.py::TestVobjectMachine::runTest - AssertionError: assert 0 == 1
937806 - Assigned to Amy Liffey
dev-python/virtualenv-clone-0.5.7 fails tests: FAILED test_virtualenv_clone.py::TestVirtualenvClone::test_clone_contents - UnicodeDecodeError: utf-8 codec cant decode byte 0xba in position 10: invalid start byte
937807 - Assigned to Python Gentoo Team
dev-python/path-17.0.0 fails tests: "AttributeError: 'builtin_function_or_method' object has no attribute '__code__'. Did you mean: '__call__'?"
938210 - Assigned to Python Gentoo Team
dev-python/pythran-0.16.1-r1 QA Notice: setuptools warnings detected
938303 - Assigned to Python Gentoo Team
dev-lang/python:2.7, dev-python/pypy: possibly rebase our branch on top of https://github.com/ActiveState/cpython
938366 - Assigned to Python Gentoo Team
dev-python/oslo-utils-7.4.0 calls commands that do not exist: mkisofs
938457 - Assigned to Gentoo OpenStack team
dev-python/tree-sitter-0.22.3: fails tests
938593 - Assigned to Python Gentoo Team
dev-python/ipykernel: still requires <dev-python/pytest-8
939418 - Assigned to Gentoo Science Related Packages
dev-python/psutil-6.0.0 fails test psutil.tests.test_process.TestProcess.test_reused_pid
939572 - Assigned to Python Gentoo Team
dev-python/widgetsnbextension-4.0.13 QA Notice setuptools warnings detected: Package 'widgetsnbextension.static' is absent from the `packages` configuration.
939710 - Assigned to Gentoo Science Related Packages
dev-python/numpy-2.2.1 fails to compile: quicksort.cpp:86:51: error: no matches converting function QSort_AVX512_SPR to type void ()(using TF = using np::meta::FixedWidth<short int>::Type = using std::conditional<true, short int, short int>::type = short
939900 - Assigned to Gentoo Science Related Packages
dev-python/spyder-6.0.1 fails to start with error: "ImportError: cannot import name 'QTextCodec' from 'qtpy.QtCore'", when using pyside{2,6} as the QtPy backend.
940202 - Assigned to Python Gentoo Team
dev-python/croniter-3.0.3 fails tests: FAILED test_croniter.py::CroniterTest::test_year - OverflowError: timestamp out of range for platform time_t
940513 - Assigned to Zac Medico
dev-python/libarchive-c-5.1 fails tests: FAILED test_entry.py::test_check_archiveentry_using_python_testtar - libarchive.exception.ArchiveError: Damaged tar archive (errno=22, retcode=-10, archive_p=1452922048)
940516 - Assigned to Andrey Grozin
dev-python/tree-sitter-0.23.0 fails test_hash test
940523 - Assigned to Python Gentoo Team
dev-python/poetry-core-1.9.0 fails tests: FAILED test_requirements.py::test_invalid_requirement[name @ file:.-invalid URL] - Failed: DID NOT RAISE <class poetry.core.version.requirements.InvalidRequirement>
940531 - Assigned to Python Gentoo Team
dev-python/python-daemon-2.3.2 fails tests
940616 - Assigned to Python Gentoo Team
dev-python/python-gnupg-0.5.3 fails tests: AssertionError: 0 != 1
940617 - Assigned to Python Gentoo Team
dev-python/qtawesome-1.3.1 fails tests: python3.12: typeobject.c:5027: _PyStaticType_Dealloc: Assertion _Py_IsImmortal((PyObject )type) failed
940618 - Assigned to Nowa Ammerlaan
dev-python/pbr-6.1.0 QA Notice: setuptools warnings detected: Package 'pbr.tests.testpackage' is absent from the `packages` configuration.
940626 - Assigned to Matthew Thode ( prometheanfire )
dev-python/sphinxcontrib-httpdomain-1.8.1 fails tests: FAILED bottle_test.py::BottleTest::test_get_routes_mount - AssertionError: mount != (:re:.)
940634 - Assigned to Python Gentoo Team
dev-python/traitlets-5.14.3 fails tests: FAILED test_argcomplete.py::TestArgcomplete::test_complete_custom_completers - AssertionError: assert {} > {DEBUG, INFO}
940636 - Assigned to Gentoo Science Related Packages
dev-python/rapidfuzz-3.10.0 - [libtool] [llvm] /.../string: error: implicit instantiation of undefined template std::char_traits<unsigned int>
941408 - Assigned to Python Gentoo Team
dev-python/aiohttp-3.10.9 fails tests
941420 - Assigned to Zac Medico
dev-python/anyio-4.8.0-r3 fails tests
941427 - Assigned to Gentoo Science Related Packages
dev-python/pysmi-1.5.0 fails tests: FAILED test_objecttype_smiv2_pysnmp.py::ObjectTypeBitsTestCase::testObjectTypeSyntax - pysnmp.proto.error.ProtocolError: Unknown named bit set
941676 - Assigned to Python Gentoo Team
dev-python/pytest-httpbin-2.1.0 fails tests: FAILED test_server.py::test_dont_crash_on_handshake_timeout - AssertionError: assert None is not None
941677 - Assigned to Python Gentoo Team
dev-python/pikepdf-9.5.2 - test_image_access.py::test_image_palette2 FAILED
942023 - Assigned to Andrey Grozin
dev-python/grpcio-1.67.0 - [gcc-15] ./.../time.h: error: VLOG was not declared in this scope
942208 - Assigned to Gentoo musl team
dev-lang/python-3.13.0: sandbox access violation at /usr/lib/pypy3.10/urllib/__pycache__
942357 - Assigned to Python Gentoo Team
dev-python/grpcio-1.67.0-r2 fails to compile: container_memory.h:66:27: error: uintptr_t does not name a type [-Wtemplate-body]
942399 - Assigned to Python Gentoo Team
dev-lang/python-3.13.0 test failures (test failure : test_posix ; test_math )
942401 - Assigned to Python Gentoo Team
dev-python/dnspython-2.7.0: fails several tests with 'cryptography.exceptions.UnsupportedAlgorithm: ECDSA with deterministic signature (RFC 6979) is not supported by this version of OpenSSL.'
942513 - Assigned to Python Gentoo Team
dev-python/cheetah3-3.3.3 fails tests
942539 - Assigned to Python Gentoo Team
dev-python/google-api-core-2.22.0 fails tests: environment: line 2500: 281 Segmentation fault ${@}
942540 - Assigned to Patrick McLean
dev-python/grpcio-status-1.67.0 fails tests: environment: line 2499: 503 Segmentation fault ${@}
942541 - Assigned to Python Gentoo Team
dev-python/imageio-2.36.0 fails tests: FAILED test_pillow_legacy.py::test_gif - SyntaxError: no more images in GIF file
942542 - Assigned to Python Gentoo Team
dev-python/pygame-2.6.1 fails tests: AssertionError: 7 != 8
942606 - Assigned to Python Gentoo Team
dev-python/wxpython-4.2.1-r2: sip_corewxWindow.cpp:48:18: fatal error: gdk/gdkx.h: No such file or directory
942761 - Assigned to Gentoo wxWidgets project
dev-python/autopep8-2.3.1 fails tests: FAILED test_autopep8.py::CommandLineTests::test_in_place_no_modifications_no_writes - AssertionError: Warning: cannot find your CPU L2 & L3 cac[43 chars]hen !=
942858 - Assigned to Python Gentoo Team
dev-python/build-1.2.2_p1 fails tests: FAILED test_ctx_logger.py::test_custom_subprocess_runner_ctx_logging[False-1-kwarg_origins1] - AssertionError: assert 3 == 2
942859 - Assigned to Python Gentoo Team
dev-python/colorclass-2.2.2-r1 fails tests: FAILED test___main__.py::test_import_do_nothing - AssertionError: assert not Warning: cannot find your CPU L2 & L3 cache size in cachen
942860 - Assigned to Python Gentoo Team
dev-python/eradicate-2.3.0 fails tests: AssertionError: Warning: cannot find your CPU L2 & L3 cac[43 chars]he
942861 - Assigned to Zac Medico
dev-python/livereload-2.7.0 fails tests: FAILED test_watcher.py::TestWatcher::test_watch_multiple_dirs - AssertionError: assert (None, None) == foo, None)
942908 - Assigned to Python Gentoo Team
dev-python/ml-dtypes-0.5.0 fails tests: FAILED finfo_test.py::FinfoTest::testFInfo_float8_e8m0fnu - assert 1.70141e+38 > 0
942909 - Assigned to Jason Zaman
dev-python/cramjam-2.9.0 fails tests: ERROR test_integration.py - AttributeError: module experimental has no attribute igzip
942946 - Assigned to Python Gentoo Team
dev-python/mypy-1.13.0 - [meson] [libtool] mypyc/build.py:280: error: Argument sources to Extension has incompatible type list[str]; expected list[str | PathLike[str]] [a
942959 - Assigned to Python Gentoo Team
dev-python/scripttest-1.3.0-r2 fails tests: FAILED test_testscript.py::test_testscript - AssertionError: stderr output not expected
942978 - Assigned to Python Gentoo Team
dev-python/sphinx-8.1.3 fails test tests/test_util/test_util_i18n.py::test_format_date_timezone
942988 - Assigned to Python Gentoo Team
dev-python/aioresponses-0.7.6 fails tests: FAILED test_aioresponses.py::AIOResponsesTestCase::test_assert_any_call - TypeError: RequestInfo.__new__() missing 1 required positional argument: real_url
943227 - Assigned to Python Gentoo Team
dev-python/pkginfo-1.11.2 fails tests: FAILED test_installed.py::test_installed_ctor_w_dist_info - AssertionError: assert 2.3 == 2.1
943310 - Assigned to Python Gentoo Team
dev-python/pyrfc3339-2.0.1 fails tests: FAILED test_all.py::TestCore::test_generate_local_parse_local - zoneinfo._common.ZoneInfoNotFoundError: No time zone found with key Eastern
943311 - Assigned to Python Gentoo Team
dev-python/scikit-learn-1.5.2 - [ncurses-6.5] [gcc-15] x86_64-pc-linux-gnu-gcc: fatal error: cannot read spec file libgomp.spec: No such file or directory
943554 - Assigned to Gentoo Science Related Packages
dev-python/pyopengl-accelerate-3.1.8 - [meson] src/numpy_formathandler.c: error: passing argument 1 of (int ( )(PyArrayObject , PyObject )) (PyArray_API + 832) from incom
944781 - Assigned to Python Gentoo Team
dev-python/python-cinderclient-9.6.0 fails tests: v3.test_auth.AuthenticateAgainstKeystoneTests.test_auth_redirect .. DEBUG:cinderclient.client:Load http response text error: Expecting value: line 1 column 1 (char 0)
945718 - Assigned to Matthew Thode ( prometheanfire )
dev-python/wand-0.6.13 fails tests (hang)
945816 - Assigned to Louis Sautier (sbraz)
dev-python/fonttools-4.55.2: differing files per wheel
945948 - Assigned to Python Gentoo Team
dev-lang/python-3.12.8: fails with 'ImportError: /usr/lib64/libcrypto.so.3: version `OPENSSL_3.3.0' not found' if using binhost package with dev-libs/openssl-3.1* installed
946313 - Assigned to binhost project
dev-python/selenium Headless selenium (firefox > v115.16.1-r1) does not work
946594 - Assigned to Python Gentoo Team
dev-lang/python: ebuild's use of CFLAGS_NODIST means `pip install` compiles C extensions without optimization or debugging info
946596 - Assigned to Python Gentoo Team
dev-python/jaraco-collections-5.1.0 fails tests: FAILED __init__.py::jaraco.collections.WeightedLookup
946845 - Assigned to Python Gentoo Team
dev-python/levenshtein-0.26.1 - [llvm] string: error: implicit instantiation of undefined template std::char_traits<unsigned int>
946989 - Assigned to Python Gentoo Team
dev-python/python-subunit-1.4.4 fails tests: FAIL: subunit.tests.test_subunit_tags.TestSubUnitTags.test_add_tag
947323 - Assigned to Python Gentoo Team
dev-python/rope-1.15.0 installs the same files with USE=doc
947385 - Assigned to Python Gentoo Team
dev-python/hypercorn-0.17.3 fails tests: FAILED path-hypercorn.access-FileHandler] - IsADirectoryError: [Errno 21] Is a directory: path
947404 - Assigned to Python Gentoo Team
dev-python/hishel-0.1.1 fails tests: FAILED test_storages.py::test_redisstorage[asyncio] - Failed: Redis server was not found
947405 - Assigned to Patrick McLean
dev-python/click-option-group-0.5.6 fails tests: FAILED test_click_option_group.py::test_missing_group_decl_first_api - assert None
947479 - Assigned to Sam James
dev-python/jsonpickle-4.0.1: fails tests/pandas_test.py::test_multindex_dataframe_roundtrip test on x86
947492 - Assigned to Python Gentoo Team
dev-python/matplotlib-3.10.0: fails tests with ffmpeg errors
947493 - Assigned to Gentoo Science Related Packages
dev-python/uvicorn-0.34.0 not installable with USE=test: Hard-blocking dependencies
947623 - Assigned to Python Gentoo Team
dev-python/markups-4.1.0 fails tests: AssertionError: .selector .nf { color: 0000FF not found in pre { line-height: 125%; }
948432 - Assigned to Python Gentoo Team
dev-python/sqlalchemy-2.0.37 fails tests
948564 - Assigned to Python Gentoo Team
dev-python/hypercorn-0.17.3 fails tests
949370 - Assigned to Python Gentoo Team
dev-python/sphinx-8.1.3 fails tests
949539 - Assigned to Python Gentoo Team
dev-python/sphinxcontrib-applehelp-2.0.0 (etc) fails tests: 'SphinxTestApp' object has no attribute 'response_class'
949541 - Assigned to Python Gentoo Team
dev-python/icalendar-6.1.1 fails tests with >=sys-libs/timezone-data-2024b
949691 - Assigned to Python Gentoo Team
dev-python/thrift: not compatible with Python 3.12
950392 - Assigned to No maintainer - Look at https://wiki.gentoo.org/wiki/Project:Proxy_Maintainers if you want to take care of it
dev-python/sphinx-8.2.3 - fails test_graphviz_latex, test_inheritance_diagram_latex on ppc/ppc64
951575 - Assigned to Python Gentoo Team
dev-python/kconfiglib: upstream owner has changed
951659 - Assigned to Python Gentoo Team
dev-python/twisted-24.11.0-r1 fails tests
951971 - Assigned to Python Gentoo Team
dev-python/audioread: needs porting to Python 3.13+
952317 - Assigned to Python Gentoo Team
dev-python/pytest-testinfra: needs porting to Python 3.13
952383 - Assigned to Python Gentoo Team
dev-python/yappi: needs porting to Python 3.13
952417 - Assigned to Patrick McLean
dev-python/pillow-11.2.0: installs suspicious Arrow.h
953032 - Assigned to Python Gentoo Team
dev-lang/python-3.12.9[pgo] with sys-apps/util-linux[uuidd] sandbox violation
953470 - Assigned to Gentoo's Team for Core System packages
dev-python/python-mpv-1.0.7 keybinding API incompatible with media-video/mpv-0.40.0
954130 - Assigned to Nowa Ammerlaan
dev-python/fastbencode-0.3.1: doesn't test C extensions
954151 - Assigned to Python Gentoo Team
dev-python/hypothesis-6.130.8 fails test_clean_source[case-5] test
954162 - Assigned to Python Gentoo Team
dev-python/lmdb-1.6.2: fails tests
954182 - Assigned to Python Gentoo Team
dev-python/zstandard-0.23.0-r2 - QA Notice: setuptools.build_meta:_legacy_ backend is deprecated. Please see:
954348 - Assigned to Python Gentoo Team
dev-python/jsonref-1.1.0 - QA Notice: pdm.pep517.api backend is deprecated. Please see:
954353 - Assigned to Python Gentoo Team
dev-python/python-augeas-1.2.0 - [gcc-15] QA Notice: Python extension modules ( .so) found installed. Please set:
954841 - Assigned to Matthew Thode ( prometheanfire )
dev-python/ini2toml: depends on dev-python/tomli
955203 - Assigned to Python Gentoo Team
dev-python/tomli-w: depends on dev-python/tomli
955204 - Assigned to Python Gentoo Team
dev-python/pbr w/ setuptools-88.3.0: module setuptools.command.easy_install has no attribute sys_executable
955411 - Assigned to Python Gentoo Team
dev-python/requests-2.32.3 fails tests with python-3.13
955435 - Assigned to Python Gentoo Team
dev-python/django-5.2 - [meson] QA Notice: Problems with installed bash completions were found:
955459 - Assigned to Python Gentoo Team
dev-python/pytest-cov-6.0.0 fails tests with python-3.13
955503 - Assigned to Python Gentoo Team
dev-python/pytest-8.3.5 fails tests
955787 - Assigned to Python Gentoo Team
dev-python/pytest-cov-6.1.1 fails tests with python-3.13
955870 - Assigned to Python Gentoo Team
dev-lang/python-3.13.3 fails test test_curses
955876 - Assigned to Python Gentoo Team
dev-python/mypy-1.15.0 fails test: StubtestUnit::test_runtime_typing_objects
955989 - Assigned to Python Gentoo Team
dev-python/numpy-2.2.5 - numpy-2.2.5/numpy/_core/src/common/pythoncapi-compat/pythoncapi_compat.h:1588:12: error: ‘_PyBytes_Join’ was not declared in this scope; did you mean ‘PyBytes_Join’?
955991 - Assigned to Gentoo Science Related Packages
dev-python/pygobject-3.50.0 - fails test_async tests
957060 - Assigned to Gentoo Linux Gnome Desktop Team
dev-python/virtualenv-20.31.2 fails tests
957078 - Assigned to Python Gentoo Team
dev-python/email-validator-2.2.0 fails tests
957083 - Assigned to Nowa Ammerlaan
dev-python/virtualenv-20.31.2 fails tests tests/unit/create/test_creator.py::test_create_distutils_cfg
957127 - Assigned to Python Gentoo Team
dev-python/pip-25.0.1-r1 fails tests
957131 - Assigned to Python Gentoo Team
dev-python/redis-6.0.0 fails test tests/test_commands.py::TestRedisCommands::test_xgroup_create_entriesread
957513 - Assigned to Sam James
dev-python/pyyaml-6.0.1-r1::HomeAssistantRepository - unsupported argument: setup.py
958169 - Assigned to Andreas Billmeier
dev-python/pandas-2.2.3[test] Failing install because of stray top-level files in site-packages
958517 - Assigned to Gentoo Science Related Packages
dev-python/django-5.2.2 fails test test_generic_ipaddress_max_length_custom
958624 - Assigned to Python Gentoo Team
dev-python/pip-25.1.1[test] failed (configure phase): pip check failed, tests will fail
958948 - Assigned to Python Gentoo Team
dev-python/click-plugins: discontinued upstream
958984 - Assigned to Python Gentoo Team
dev-python/protobuf-6.31.1 - fails TimeUtilTest::testTimezoneAwareDatetimeConversionWhereTimestampLosesPrecision, TimeUtilTest::testTimezoneNaiveDatetimeConversionWhereTimestampLosesPrecision: OverflowError: timestamp out of range for platform time_t
959442 - Assigned to Python Gentoo Team
dev-python/pytest-trio-0.8.0-r1 fails tests
959726 - Assigned to Nowa Ammerlaan
dev-python/more-itertools-10.7.0[doc]: exception: Could not find style module 'pygments.styles.a11y-dark'.
960486 - Assigned to Python Gentoo Team
dev-python/babel-2.17.0 fails test - [meson] [gcc-16] E AssertionError: assert 11.4612.04 aikavyhyke: Suomi == 13.4614.04 aikavyhyke: Suomi
960861 - Assigned to Python Gentoo Team
dev-python/protobuf-6.31.1: Test phase fails with 'google/protobuf/unittest.proto: is an editions file, but code generator --python_out hasn't been updated to support editions yet.'
960877 - Assigned to Python Gentoo Team
dev-python/pyspnego-0.11.2 fails test - [meson] [gcc-16] E spnego.exceptions.BadMechanismError: SpnegoError (1): SpnegoError (4294967295): Major (851968): Unspecified GSS
960896 - Assigned to Python Gentoo Team
dev-python/sqlglot-27.5.1 fails test with sys-libs/timezone-data[zic-slim] - E AssertionError: CAST(2023-01-01 12:13:14+00:00 AS TIMESTAMP) != CAST(2023-01-01 12:13:14-08:00 AS TIMESTAMP)
960944 - Assigned to Alfred Wingate
dev-python/enrich-1.2.7-r1 fails test - [meson] [gcc-16] E assert False
960947 - Assigned to Python Gentoo Team
dev-python/structlog-25.4.0 fails test - [meson] [gcc-16] E AttributeError: NoneType object has no attribute f_globals
960950 - Assigned to Bernard Cafarelli
dev-python/pytz-2025.2 fails test with sys-libs/timezone-data[zic-slim] - AssertionError: datetime.timedelta(0) != datetime.timedelta(seconds=5040) : Expected 1:24:00 as utcoffset for 1915-08-04 20:36:00+00:00. Got 0:00:00
960960 - Assigned to Python Gentoo Team
dev-python/lxml-6.0.0 fails test - [meson] [jdk25] FAIL: test_wrap_html (lxml.html.tests.test_elementsoup.SoupParserTestCase.test_wrap_html)
961095 - Assigned to Python Gentoo Team
dev-python/simpervisor-1.0.0-r1 fails test - [meson] [jdk25] E assert False
961102 - Assigned to Python Gentoo Team
dev-python/orjson-3.11.1 fails test - [meson] [jdk25] E assert b[2018-01-01T02:03:04+00:00] == b[2018-01-01T02:03:04+08:00]
961151 - Assigned to Python Gentoo Team
dev-python/vobject-0.9.8 fails test - [meson] [jdk25] FAIL: test_change_tz (tests.TestChangeTZ.test_change_tz)
961179 - Assigned to Python Gentoo Team
dev-python/serpent-1.41 fails test - [meson] [jdk25] FAIL: test_timezone (test_serpent.TestBasics.test_timezone)
961183 - Assigned to Python Gentoo Team
dev-python/click-plugins-1.1.1-r1 fails test - [meson] [jdk25] E assert 2 == 0
961224 - Assigned to Python Gentoo Team
dev-python/numpy-2.3.2 fails test test_npy_uintp_type_enum: "ModuleNotFoundError: No module named 'checks'"
961278 - Assigned to Gentoo Science Related Packages
dev-python/pytest-asyncio-1.1.0 fails test TestClassScopedLoop::test_this_runs_in_same_loop
961279 - Assigned to Python Gentoo Team
dev-python/daemonize-2.5.0-r1 fails test - [gcc-16] FAIL
961548 - Assigned to Python Gentoo Team
dev-python/pyudev-0.24.3 fails test - [gcc-16] E FileNotFoundError: [Errno 2] No such file or directory: /.../msr
961561 - Assigned to Arthur Zamarin
dev-python/pymongo-4.14.0 - Could not find style module 'pygments.styles.a11y-dark'
961586 - Assigned to Python Gentoo Team
dev-python/loky-3.5.5 fails test - [gcc-16] ValueError: Cannot register /loky-105-2vc44x2q for automatic cleanup: unknown resource type semlock
961726 - Assigned to Python Gentoo Team
sys-devel/binutils: mishandles GNU2 TLS relocs on arm (dev-lang/python: fails to build with -mtls-dialect=gnu2 on arm)
961910 - Assigned to Gentoo Toolchain Maintainers
dev-python/versioningit-3.3.0 fails test - [jdk25] ModuleNotFoundError: No module named coverage
962063 - Assigned to Python Gentoo Team
dev-python/pkgcraft-0.0.11 fails test - [jdk25] ImportError: /.../libpkgcraft.so.0.0.16: undefined symbol: bind_variable
962151 - Assigned to Sam James
dev-python/pdm-2.25.9 fails test - [jdk25] INTERNALERROR> AssertionError: (tests/test_utils.py::TestUrlToPath::test_windows_localhost_local_file_url, <WorkerController gw
962189 - Assigned to Python Gentoo Team
dev-python/b2sdk-2.13.2 - [jdk25] QA Notice: The directory b2sdk occludes package installed for python3.13.
962240 - Assigned to Sam James
dev-python/stevedore-5.5.0[doc]: TypeError: unsupported operand type(s) for +: 'NoneType' and 'list'
962372 - Assigned to Gentoo OpenStack team
dev-python/psutil-7.0.0 fails test - [gcc-16] E PermissionError: [Errno 13] Permission denied: /.../ssmtp.conf
962838 - Assigned to Python Gentoo Team
dev-python/pywayland-0.4.18 fails test - [gcc-16] test/test_event_queue.py::test_event_queue FAILED [ 2/42]
962899 - Assigned to Python Gentoo Team
dev-python/gssapi-1.10.0 fails test - [gcc-16] E AssertionError: bhost/localhost@ != bhost/mr-fox.localdomain@
962900 - Assigned to Python Gentoo Team
dev-python/blosc-1.11.3 fails test - [gcc-16] FAIL: compress_ptr (blosc.toplevel)
962901 - Assigned to Gentoo Science Related Packages
dev-python/apache-libcloud-3.8.0-r1 fails test - [gcc-16] E AttributeError: module paramiko has no attribute DSSKey. Did you mean: RSAKey?
962928 - Assigned to Python Gentoo Team
dev-python/sympy-1.14.0-r1 fails test - [gcc-16] _ ERROR collecting sympy/.../test_torch.py _
962938 - Assigned to Andrey Grozin
dev-python/restructuredtext-lint-1.4.0 fails test - [gcc-16] FAIL: test_level_fail (restructuredtext_lint.test.test.TestRestructuredtextLintCLI.test_level_fail)
963029 - Assigned to Matthew Thode ( prometheanfire )
dev-python/pycurl-7.45.6 fails test - [gcc-16] [ffmpeg8] [boost-1.89] E AssertionError: 0: bConnected to 127.0.0.1 not found in debug entries
963030 - Assigned to Python Gentoo Team
dev-python/argcomplete-3.6.2 fails test with zsh 5.9.0.3 - FAIL: test_python_completion (_main_.TestZshGlobalExplicit.test_python_completion)
963979 - Assigned to Python Gentoo Team
dev-python/protobuf-6.31.1 fails 2 numpy tests
963999 - Assigned to Python Gentoo Team
dev-python/pysnmp-7.1.21 fails test - [ffmpeg8] [gcc-16] [nasm-3] ERROR: dev-python/pysnmp-7.1.21::gentoo failed (test phase):
964005 - Assigned to Gentoo Netmon project
dev-lang/python-3.14.0 fails sandbox with USE=pgo
964011 - Assigned to Python Gentoo Team
dev-python/requests-oauthlib-2.0.0 fails test - [ffmpeg8] [gcc-16] [nasm-3] E AssertionError: 1760115006 != 1760115005.7788856 within 2 places (0.2211143970489502 differe
964013 - Assigned to Python Gentoo Team
dev-python/scikit-build-0.18.1 fails test - [ffmpeg8] [gcc-16] [nasm-3] E AssertionError: assert Error: could not load cache in Error: not a CMake build directory (missin
964015 - Assigned to Gentoo Science Related Packages
dev-python/mechanicalsoup-1.4.0 fails test - [ffmpeg8] [gcc-16] [nasm-3] E mechanicalsoup.utils.LinkNotFoundError
964242 - Assigned to William Hubbs
dev-python/pyglet-2.1.9 fails test - collecting ... terminate called after throwing an instance of 'std::out_of_range' what(): vector::_M_range_check: __n (which is 4294967295) >= this->size() (which is 0)
964361 - Assigned to Gentoo Science Related Packages
dev-python/keep-2.11 fails test - [ffmpeg8] [gcc-16] [nasm-3] Smoke test failed with python3.13
964362 - Assigned to Python Gentoo Team
dev-python/ftfy-6.3.1 fails test - [ffmpeg8] [gcc-16] [nasm-3] FAILED ftfy/formatting.py::ftfy.formatting.monospaced_width
964365 - Assigned to Python Gentoo Team
dev-python/tubes-0.2.1 fails test - [boost-1.89] [ffmpeg8] [portage-9999] E twisted.trial.unittest.FailTest: None
964976 - Assigned to Python Gentoo Team
dev-python/asttokens-3.0.0-r1 fails test - [boost-1.89] [ffmpeg8] [portage-9999] FAILED tests/test_astroid.py::TestAstroid::test_adjacent_joined_strings - TypeError: Astr
964981 - Assigned to Python Gentoo Team
dev-python/time-machine-2.19.0 fails test - [ffmpeg8] [gcc-16] [portage-9999] E assert 0.0 == (0.0 + 21600.0)
965065 - Assigned to Python Gentoo Team
dev-python/base58-2.1.1 - [ffmpeg8] [gcc-16] [portage-9999] file collision with dev-libs/libbase58-0.1.4-r2
965170 - Assigned to Python Gentoo Team
dev-python/pillow-11.3.0 fails tests
965688 - Assigned to Python Gentoo Team
dev-python/pelican-minify-2.0.0 fails test - E TypeError: minify() got an unexpected keyword argument do_not_minify_doctype
966317 - Assigned to Python Gentoo Team
dev-python/gitdb-4.0.12 fails test - E assert bx\x01bdbfaecg\xe0\xe0d\xe0b\xe0f\xe0a\xe0e\xe0c\xe0g\x10\x10d\x10b\x10f\x10a\x10e\x10c\x10g\x90\x90d\x90b\x90f\x90a\x90e\x9
966335 - Assigned to Python Gentoo Team
dev-python/cvxopt-1.3.2 fails test - tests/test_custom_kkt.py::TestCustomKKT::test_l1 Fatal Python error:<snip> Segmentation fault
966390 - Assigned to Gentoo Science Mathematics related packages
dev-python/ansible-pylibssh-1.3.0 - [gcc-16] [jdk26] sftp.c: fatal error: libssh/sftp.h: No such file or directory
966499 - Assigned to Python Gentoo Team
dev-python/flask-3.1.2 missing async extension
966532 - Assigned to Python Gentoo Team
dev-python/numpy-2.3.2 failed to emerge
966717 - Assigned to Gentoo Science Related Packages
dev-python/rdflib-7.5.0 - file collision with app-crypt/sequoia-sq-1.3.1-r1
966800 - Assigned to Python Gentoo Team
dev-python/jinja2-3.1.6 - [gcc-16] [meson] ERROR: dev-python/jinja2-3.1.6::gentoo failed (compile phase):
967292 - Assigned to Python Gentoo Team
dev-python/flask-3.1.2 - sphinx.errors.ExtensionError
967366 - Assigned to Python Gentoo Team
dev-python/psutil-7.1.3 fails test TestSystemAPITypes::test_users
967614 - Assigned to Python Gentoo Team
dev-python/flask-babel-4.0.0 - [gcc-16] ERROR: dev-python/flask-babel-4.0.0::gentoo failed (compile phase):
967679 - Assigned to Python Gentoo Team
dev-lang/python-3.14.0_p1[pgo]: sandbox violation
967781 - Assigned to Python Gentoo Team
dev-python/ruamel-yaml-clib: removal
968369 - Assigned to Zoltan Puskas
dev-python/tabulate-0.9.0-r1 fails test - [gcc-16] E AssertionError: Failure on non-wide char multiword regression check for width 2
968624 - Assigned to Python Gentoo Team
dev-python/uvloop-0.22.1 test TestAsyncio_AIO_Process::test_cancel_post_init is flaky
968709 - Assigned to Python Gentoo Team
dev-python/pytest-regressions: investigate plugin dep on pytest-datadir
968881 - Assigned to Python Gentoo Team
dev-python/pythran-0.18.1: TestNumpyIHFFT::test_ihfft_14 - RuntimeError: Something happened on the way to heaven
969057 - Assigned to Python Gentoo Team
dev-python/griddataformats-1.2.0 - [portage-9999] QA Notice: The following Python packages were installed with
969180 - Assigned to Gentoo Science Related Packages
dev-python/beautifulsoup4-4.14.3 fails test_fuzz.py test
969236 - Assigned to Python Gentoo Team
dev-python/sqlglot-28.7.0 - [glibc-2.43] [jdk26] QA Notice: found Cargo.toml file which specifies rust-version="1.81"
969463 - Assigned to Alfred Wingate
dev-python/plotly: incorrect dependencies
969471 - Assigned to Gentoo Science Related Packages
dev-python/ensurepip-wheel-0.46.3 fails test - [gcc-16] [glibc-2.43] [meson] E [
969507 - Assigned to Python Gentoo Team
dev-python/urllib3-2.6.3 fails test - [gcc-16] [glibc-2.43] [meson] pytest failed with python3.13
969515 - Assigned to Python Gentoo Team
dev-python/pytest-trio-0.8.0-r1 fails test - [gcc-16] [glibc-2.43] [meson] E AssertionError: assert {passed: 0, skipped: 0, failed: 0, errors: 0, xpassed: 0, xfailed: 0}
969516 - Assigned to Nowa Ammerlaan
dev-python/rich-14.3.2 fails test - [gcc-16] [glibc-2.43] [meson] E FileNotFoundError: [Errno 2] No such file or directory: which
969517 - Assigned to Python Gentoo Team
dev-python/sphinx-9.0.4-r1:0/0::gentoo : dependency conflict
969666 - Assigned to Python Gentoo Team
dev-python/expandvars-1.1.2 fails tests
969870 - Assigned to Python Gentoo Team
dev-python/testresources-2.0.2 fails test
969980 - Assigned to Matthew Thode ( prometheanfire )
dev-python/testscenarios-0.5.0-r3 fails tests: "ModuleNotFoundError: No module named 'testtools.tests'"
969981 - Assigned to Matthew Thode ( prometheanfire )
dev-python/pytest-xdist-3.8.0 fails tests
969983 - Assigned to Python Gentoo Team
dev-python/rfc3161-client-1.0.3 fails tests: "Verify error: certificate has ' 'expired"
970009 - Assigned to Python Gentoo Team
dev-python/pytest-subtests-0.15.0 fails tests (IndexError: list index out of range)
970013 - Assigned to Python Gentoo Team
dev-python/electrum-ecc-0.0.6: referring to non existing sub-slot 0/5 on dev-libs/libsecp256k1
970178 - Assigned to Python Gentoo Team
dev-python/pybind11-3.0.2: Cannot allocate memory (empty 16Gb computer, MAKEOPTS="-j1") with FEATURES=usersandbox
970324 - Assigned to Jason Zaman
dev-python/sh: removal
970796 - Assigned to Patrick McLean
dev-python/breathe-4.36.0 revisit texlive dependencies
971074 - Assigned to Python Gentoo Team
dev-lang/pypy3-exe-3.11.7.3.21 - translation failed
971166 - Assigned to Python Gentoo Team
dev-python/bcrypt calls CC directly
971202 - Assigned to Python Gentoo Team
dev-python/scipy: Crash with embedded python in scipy when using flexiblas
971309 - Assigned to Gentoo Science Related Packages
dev-python/lmdb: tests crashing
971352 - Assigned to Python Gentoo Team
dev-python/kiwisolver-1.5.0 - [jdk26] [portage-9999] py/.../kiwisolver.cpp: fatal error: version.h: No such file or directory
971415 - Assigned to Python Gentoo Team
dev-python/chardet: upstream has become AI slop
971501 - Assigned to Python Gentoo Team
dev-python/pkg-resources-81.0.0 - [boost-1.90] [meson] QA Notice: Package installs pkg_resources namespace packages that
971555 - Assigned to Python Gentoo Team
dev-python/nanobind-2.11.0 emerge fail at scikit-build-core cmake configuration
971595 - Assigned to Python Gentoo Team
dev-python/docutils: circular dependency with dev-python/pillow -> dev-libs/harfbuzz -> dev-libs/glib -> dev-python/docutils
972321 - Assigned to Python Gentoo Team
dev-python/cryptography: future need for OpenSSL alternatives (LibreSSL, aws-lc, BoringSSL)
972373 - Assigned to Python Gentoo Team
dev-python/jwcrypto-1.5.7 - [boost-1.90] [gcc-16] [glibc-2.43] QA Notice: The ebuild is installing to one or more unexpected directories:
972390 - Assigned to Python Gentoo Team
dev-python/numpy-2.3.5 fails numpy/f2py/tests/test_f2py2e.py::test_gen_pyf test
972400 - Assigned to Gentoo Science Related Packages
dev-python/pydantic-2.13.0_beta3 - [boost-1.90] [glibc-2.43] unpack: cfg-if-1.0.0.crate either does not exist or is not a regular file
972430 - Assigned to Python Gentoo Team
dev-python/pybind11-3.0.3 Wheel build failed
972461 - Assigned to Jason Zaman
sys-apps/portage keeps messing up verify-provenance deps on rebuild for e.g. dev-python/pypi-attestations, dev-python/idna
972632 - Assigned to Python Gentoo Team
dev-lang/python-3.13.13_p1 - [openssl-4] [ERROR] _ssl failed to import: /.../_ssl.cpython-313-x86_64-linux-gnu.so: undefined symbol: TLSv1_method
973120 - Assigned to Python Gentoo Team
dev-python/readme-renderer-44.0 fails test test_cli_explicit_format[test_rst_003.rst]
973699 - Assigned to Python Gentoo Team
dev-python/pycurl-7.45.7 fails tests
973700 - Assigned to Python Gentoo Team
dev-python/tornado-6.5.5 fails test test_bind_source_ip
973702 - Assigned to Python Gentoo Team
dev-python/traitlets-5.14.3 fails tests
973704 - Assigned to Gentoo Science Related Packages
dev-python/jedi-0.19.2 fails test TestSetupReadline::test_import
973713 - Assigned to Python Gentoo Team
dev-python/keep: needs upgrade to Python 3.14
973860 - Assigned to Python Gentoo Team
dev-python/nuitka: needs upgrade to Python 3.14
973873 - Assigned to OzTiram
dev-python/poetry-plugin-export: needs upgrade to Python 3.14
973880 - Assigned to Python Gentoo Team
dev-python/sphinxcontrib-bibtex: needs upgrade to Python 3.14
973915 - Assigned to Python Gentoo Team
dev-python/pikepdf-10.6.0 - [gcc-17] QA Notice: One or more CMake variables were not used by the project:
975076 - Assigned to Andrey Grozin
=dev-python/ml-dtypes-0.5.4 fails compile of bundled eigen with gcc-15/16/17: invalid user-defined conversion from ‘const Eigen::half’ to ‘_Float16’
975256 - Assigned to Jason Zaman
dev-python/libpass-1.9.3 fails test AppWalletTest.test_encrypt_cost_timing
975349 - Assigned to Matthew Thode ( prometheanfire )
dev-python/nuitka: LICENSE has changed to AGPL-3-with-linking-exception
975620 - Assigned to OzTiram
dev-python/multidict-7.1.0 adds -Werror flag on its own
976111 - Assigned to Python Gentoo Team
dev-python/securesystemslib-1.4.0 fails tests: ERROR test_signer.py::TestGPGRSA::test_gpg_signer_load_with_bad_scheme - FileNotFoundError: [Errno 2] No such file or directory: S.scdaemon
976181 - Assigned to Python Gentoo Team
dev-python/whenever-0.10.0 installs modules that are not byte-compiled
976182 - Assigned to Python Gentoo Team
dev-python/typer-0.26.3 fails tests: FAILED test_completion.py::test_install_completion - AssertionError: assert source in
976269 - Assigned to OzTiram
dev-lang/pypy-3.12.8.0.0 calls cc directly
976324 - Assigned to Python Gentoo Team
dev-python/commonmark: last rites, superseded by dev-python/markdown-it-py
976431 - Assigned to Python Gentoo Team
dev-python/recommonmark: last rites, superseded by dev-python/myst-parser
976432 - Assigned to Python Gentoo Team
dev-python/ensurepip-pip-26.1.2 fails tests: ERROR test_pep517.py - ImportError while importing test module ensure..
976448 - Assigned to Python Gentoo Team
dev-python/httpx-0.28.1-r1 fails tests with python3.14
976735 - Assigned to Python Gentoo Team
dev-python/sigstore-4.2.0 fails tests with python-3.14
976745 - Assigned to Python Gentoo Team
dev-python/terminado-0.18.1 fails test UniqueTermTests::test_max_terminals
976751 - Assigned to Python Gentoo Team
dev-python/rich-15.0.0 fails tests after upgrade to python-3.14
976753 - Assigned to Python Gentoo Team
dev-python/pytest-9.0.2 test timeout on slow CPU after python-3.14 upgrade
976768 - Assigned to Python Gentoo Team
dev-python/django-6.0.6 fails tests
976826 - Assigned to Python Gentoo Team
dev-lang/python-3.14: binpkg requires libunwind.so.8 but fails to specify it in RDEPEND
976861 - Assigned to LLVM support project
dev-python/psycopg-3.3.6 QA Notice: Package creating at least one pure Python wheel installs different Python files between implementations
977253 - Assigned to Python Gentoo Team
dev-python/cbor2-6.0.1: fails to build on x86 (error: literal out of range for `usize`)
977418 - Assigned to Python Gentoo Team
dev-python/inline-snapshot-0.34.1 fails tests: FAILED test_pytest_diff_fix.py::test_pytest_diff_fix - assert > assert price == snapshot({nE AssertionError: assert ..
977437 - Assigned to Python Gentoo Team
dev-python/quart-0.20.0 fails test
977457 - Assigned to Python Gentoo Team
dev-python/nanobind-3.1.0 adds -Werror flag on its own
977692 - Assigned to Python Gentoo Team
dev-python/pyqtgraph-0.14.0 fails test tests/exporters/test_svg.py::test_simple - ValueError: not enough values to unpack (expected 2, got 1)
977783 - Assigned to Python Gentoo Team
dev-python/ini2toml-0.15 fails tests test_handle_license test_handle_license_and_files
977895 - Assigned to Python Gentoo Team
dev-python/numpy-2.5.0 with mold fails test numpy/f2py/tests/test_f2py2e.py::test_cli_obj: mold: fatal: ../extra.o: unknown file type
977897 - Assigned to Gentoo Science Related Packages
dev-python/urllib3-2.7.0 fails tests with dev-python/pyopenssl-26.3.0
977911 - Assigned to Python Gentoo Team
dev-python/argparse-manpage-4.7 fails tests: FAILED test_examples.py::TestAllExamples::test_pre_written_man_page[pip] - FileNotFoundError: [Errno 2] No such file or directory: d..
978073 - Assigned to Patrick McLean
dev-python/cython-test-exception-raiser-26.4.1 found directory that occludes package installed for python
978156 - Assigned to Python Gentoo Team
dev-python/extras-1.0.0-r2 fails tests: AttributeError: TestTryImport object has no attribute assertEquals Did you mean: assertEqual?
978174 - Assigned to Python Gentoo Team
dev-python/flask-caching-2.4.0 fails tests: AssertionError: assert None == qux
978176 - Assigned to Python Gentoo Team
dev-python/gfloat-0.5.2-r1 fails tests: OverflowError: Python int too large to convert to C long
978178 - Assigned to Python Gentoo Team
dev-python/github3-py-4.0.1 fails tests: FAILED test_github_session.py::TestGitHubSession::test_default_timeout - AssertionError: expected call not found
978180 - Assigned to Python Gentoo Team
dev-python/iminuit-2.32.0 fails tests: FAILED test_cost.py::test_CostSum_visualize - ValueError: Figure 1 already exists Use plt.figure(1) to get it or plt.clo..
978183 - Assigned to Andrey Grozin
dev-python/jaraco-envs-2.6.0 fails tests: FAILED test_envs.py::test_root_pathlib[Path0-VirtualEnv] - subprocess.CalledProcessError: Command jarac..
978185 - Assigned to Python Gentoo Team
dev-python/jaraco-versioning-1.1.0 fails tests: FAILED versioning.py::versioning.SummableVersion
978186 - Assigned to Python Gentoo Team
dev-python/jupyter-console-6.6.3-r1 fails tests: FAILED test_console.py::test_console_starts - pexpect.exceptions.TIMEOUT: Timeout exceeded
978188 - Assigned to Gentoo Science Related Packages
dev-python/moto-5.2.2 fails tests: FAILED test_lambda_eventsourcemapping.py::test_get_event_source_mapping - botocore.exceptions.ParamValidationError: Parameter validation failed:
978246 - Assigned to Patrick McLean
dev-python/narwhals-2.22.1 fails tests: FAILED dtypes_test.py::test_second_time_unit - worker gw0 crashed while running dtypes_test.py::test_secon..
978248 - Assigned to Python Gentoo Team
dev-python/oslo-i18n-6.8.0 fails tests: testtools.matchers._impl.MismatchError: 5 != 6: [en_US, es_ES, fil_PH, it, en_GB, it]
978250 - Assigned to Matthew Thode ( prometheanfire )
dev-python/outputcheck-0.4.2-r2 fails tests: FAIL: OutputCheck :: failing-simple-check-next-lit.smt2 (35 of 50)
978251 - Assigned to Maciej Barć
dev-python/moto-5.2.2 found directory that occludes package installed for python
978252 - Assigned to Patrick McLean
dev-python/oslo-log-8.3.2 found directory that occludes package installed for python
978253 - Assigned to Matthew Thode ( prometheanfire )
dev-python/pdfrw-0.4_p1-r1 fails tests
978263 - Assigned to Python Gentoo Team
dev-python/poetry-plugin-export-1.10.0 fails tests: FAILED test_exporter_pylock_toml.py::test_export_markers[groups11-extras11-python_version >= 3.6 or extra == extra1-python_version >= 3.6] - assert marker = python_version >= \3.6\ in [lock-version = 1.
978264 - Assigned to Python Gentoo Team
dev-python/librt adds its own -O<values> overriding user CFLAGS
978292 - Assigned to Python Gentoo Team
dev-python/pytest-twisted-1.14.3-r1 fails tests: FAILED test_basic.py::test_hypothesis_async_fails - AssertionError:
978311 - Assigned to Matt Jolly
dev-python/python-lsp-black-2.0.0-r2 fails tests: FAILED test_plugin.py::test_pylsp_format_document_syntax_error - black.parsing.SourceASTParseError: cannot use --safe with this file; failed..
978313 - Assigned to Nowa Ammerlaan
dev-python/python-lsp-server-1.14.0 fails tests: FAILED test_completion.py::test_snippets_completion - AssertionError: assert defaultdict() == defaultdict($0)
978314 - Assigned to Nowa Ammerlaan
dev-python/pytest-reraise-2.1.2 QA Notice: poetry.masonry.api backend is deprecated
978318 - Assigned to Python Gentoo Team
dev-python/rq-2.10.0 fails tests: FAILED test_job_dependency.py::TestJobDependency::test_execution_order_with_dual_dependency - AssertionError: Lists differ: [slow_1:w2, A:w1, B:w1, slow_2:w2] !=..
978331 - Assigned to Sam James
dev-python/pythran-0.18.1 fails tests: FAILED test_numpy_func0.py::TestNumpyFunc0::test_cross1 - ValueError: Both input arrays must be (arrays of) 3-dimensional vectors, bu..
978333 - Assigned to Python Gentoo Team
dev-python/seaborn-0.13.2 fails tests: FAILED test_plot.py::TestPlotting::test_theme_validation - AssertionError: Regex pattern did not match
978339 - Assigned to Python Gentoo Team
dev-python/mypy-2.1.0 fails tests
978390 - Assigned to Python Gentoo Team
dev-python/treq-25.5.0 fails to compile: FAILED test_cryptography.py::TestCryptography::test_cert_builder_ecc - TypeError: Cant instantiate abstract class tpm_ecc_private_key without an ..
978395 - Assigned to Python Gentoo Team
dev-python/uvicorn-0.49.0 fails tests: ERROR test_http.py - Failed: benchmark not found in markers configuration option
978397 - Assigned to Python Gentoo Team
dev-python/virtualenvwrapper-6.1.1 fails tests: ERROR: Could not find a version that satisfies the requirement setuptools>=40.8.0 (from versions: none)
978399 - Assigned to Alfred Wingate
dev-python/whenever-0.10.0 fails tests: FAILED test_misc.py::test_time_machine - ValueError: Invalid isoformat string: 1980-03-02 02:00 UTC
978401 - Assigned to Python Gentoo Team
dev-python/xarray-2026.4.0 fails tests: OverflowError: Overflow in int64 timedelta64 multiplication
978402 - Assigned to Python Gentoo Team
dev-python/sphinx-9.1.0-r1 fails test test_ext_imgconverter: convert: attempt to perform an operation not allowed by the security policy `SVG' @ error/constitute.c/IsCoderAuthorized/461. convert: no images defined
978881 - Assigned to Python Gentoo Team
dev-python/requests-mock-1.12.1 fails test MockerTests.test_with_decorator_called_multiple_times: AttributeError: 'MockerTests' object has no attribute 'assertEquals'. Did you mean: 'assertEqual'?
978930 - Assigned to Python Gentoo Team
dev-python/pycurl-7.47.0 fails tests: pycurl.error: (48, 'An unknown option was passed in to libcurl')
978932 - Assigned to Python Gentoo Team
dev-python/apscheduler-3.11.3 fails tests: FAILED test_jobstores.py::test_mongodb_client_ref - ImportError: MongoDBJobStore requires PyMongo installed
979170 - Assigned to Zac Medico
dev-python/hpack-4.2.0 fails to compile: USE Flag python_targets_python3_14t not in IUSE for hpack-4.2.0
979171 - Assigned to Python Gentoo Team
dev-python/mygpoclient-1.10 fails tests: FAILED http_test.py::Test_HttpClient::test_GET - urllib.error.URLError: <urlopen error [Errno 111] Connection refused>
979172 - Assigned to Gentoo Sound Team
dev-python/mypy-2.2.0 fails tests: FAILED test_run.py::TestRun::run-vecs-i64.test::testVecI64BasicOps_librt - data: test-dat..
979173 - Assigned to Python Gentoo Team
dev-python/paho-mqtt-2.1.0 fails tests: FAILED test_08_ssl_connect_alpn.py::test_08_ssl_connect_alpn - ssl.SSLError: [SSL: SSLV3_ALERT_CERTIFICATE_EXPIRED] tls alert certific..
979232 - Assigned to Matt Turner
dev-python/pycairo-1.29.0-r1 fails to compile: AttributeError: SourceFileLoader object has no attribute load_module
979234 - Assigned to Python Gentoo Team
dev-python/setuptools-79.0.1 QA Notice: Package installs pkg_resources namespace packages that are deprecated
979235 - Assigned to Python Gentoo Team
dev-python/podman-5.8.0 fails tests: ERROR test_utils.py - FileNotFoundError: [Errno 2] No such file or directory: podman
979330 - Assigned to Zac Medico
dev-python/pyrsistent-0.20.0 fails tests: pvectorcmodule.c:1316:22: error: implicit declaration of function _PyList_Extend [-Wimplicit-function-declaration]
979331 - Assigned to Python Gentoo Team
dev-python/pytest-asyncio-1.4.0 fails tests: FAILED test_class_scope.py::test_asyncio_mark_respects_the_loop_policy - AssertionError: assert {passed: 2, skipped: 0, failed: 0, errors: 0..
979332 - Assigned to Python Gentoo Team
dev-python/python-gnupg-0.5.6 fails tests with app-crypt/gnupg-2.5.21 (FAIL: test_file_encryption_and_decryption (test_gnupg.GPGTestCase.test_file_encryption_and_decryption) - AssertionError: 33188 != 33216)
979334 - Assigned to Python Gentoo Team
dev-python/pythran-0.18.1-r1 fails tests (hang)
979395 - Assigned to Python Gentoo Team
dev-python/scipy-1.17.1 fails tests: FAILED test_extending.py::test_cython - subprocess.CalledProcessError: Command [meson, compile, -vv] return..
979396 - Assigned to Gentoo Science Related Packages
dev-python/pypy-exe-7.3.23 - [meson] [perl-5.44] translation failed
979442 - Assigned to Python Gentoo Team
dev-python/starlette-1.3.1 fails tests: FAILED test_requests.py::test_request_headers[asyncio] - AssertionError: assert {headers: {accept: , accept-encoding: gz..
979558 - Assigned to Python Gentoo Team
dev-python/weasyprint-69.0 fails tests: FAILED test_cmyk_color_profiles.py::test_device_cmyk_with_icc - Failed: Pixel (0, 0) in device_cmyk_with_icc: expected rgba(50, 76, 103), g..
979564 - Assigned to Python Gentoo Team
dev-python/srt-3.5.3 found directory that occludes package installed for python
979565 - Assigned to Sam James
dev-python/jupyter-server-2.20.0 fails tests
979582 - Assigned to Gentoo Science Related Packages
dev-python/httpx2-2.4.0 fails test_h2_timeout_during_response[trio] test: "AssertionError: assert False"
979585 - Assigned to Python Gentoo Team
dev-python/fsspec-2026.6.0 fails tests: FAILED test_cached.py::test_filecache_with_checks - AssertionError: assert test datatest data == test data
979620 - Assigned to Python Gentoo Team
dev-python/unrardll-0.1.7 fails tests: test_extract (test.test_basic.BasicTests.test_extract) .. gcmodule.c:113: gc_decref: Assertion gc_get_refs(g) > 0 failed: refcount is too small
979621 - Assigned to Eli Schwartz
mail-filter/pyzor-1.1.2 fails tests: FAILED test_client.py::ClientTest::test_ping - AssertionError: {Op: ping, Thread: 33715, PV: 2.[59 chars]Sig} ..
979837 - Assigned to Python Gentoo Team
dev-python/pypdf-6.14.2 fails tests (parallel test execution only)
980160 - Assigned to Python Gentoo Team
dev-python/sgmllib3k: removal
980200 - Assigned to Python Gentoo Team
dev-python/ansible-compat-26.6.0 fails test test/test_runtime.py::test_runtime_plugins
980274 - Assigned to Python Gentoo Team
dev-python/faker: coexist with dev-ruby/faker
980294 - Assigned to Bernard Cafarelli
dev-python/requests-cache-1.3.3 found directory that occludes package installed for python
980296 - Assigned to Jason A. Donenfeld
dev-lang/python with USE=pgo is too rigid
980473 - Assigned to Python Gentoo Team
dev-python/awscrt-0.36.1 - [boost-1.91] [eigen-5.0] [jdk27] source/crc.c: error: implicit declaration of function aws_checksums_crc32_combine
980637 - Assigned to Python Gentoo Team
dev-python/python-discovery-1.5.2 fails tests: FAILED test_iter_interpreters.py::test_iter_interpreters_no_key_includes_running_interpreter - assert False
980797 - Assigned to Python Gentoo Team
dev-python/sympy-1.14.0-r2 fails tests
980821 - Assigned to Andrey Grozin
dev-python/scikit-build-0.19.1 with clang fails test test_symbol_visibility: AssertionError: assert 'LOCAL' in ' 21: 0000000000001280 143 FUNC GLOBAL DEFAULT 13 get_map'
981013 - Assigned to Gentoo Science Related Packages
dev-python/statsmodels-0.14.6 fails test stats/tests/test_moment_helpers.py: Duplicate parametrization IDs detected, but strict_parametrization_ids is set.
981033 - Assigned to Python Gentoo Team
dev-python/xarray-2026.7.0 fails tests TestNetCDF4Data::test_compression_encoding[szip] TestNetCDF4DataTree::test_compression_encoding[szip]: RuntimeError: NetCDF: Filter error: undefined filter encountered: (variable 'var2', group '/')
981036 - Assigned to Python Gentoo Team
dev-python/ini2toml-0.15 fails test test_pytest[convert0-multiline-addopts]
981037 - Assigned to Python Gentoo Team
dev-python/cython-test-exception-raiser-26.4.1 - [boost-1.91] [portage-9999] cython_test_exception_raiser/raiser.c: error: implicit declaration of function PyInterpreterS
981284 - Assigned to Python Gentoo Team
dev-python/pygame-2.6.1 - [jdk27] [portage-9999] ERROR: dev-python/pygame-2.6.1::gentoo failed (configure phase):
981337 - Assigned to Python Gentoo Team
dev-python/nanobind-2.13.0 fails to build
981391 - Assigned to Python Gentoo Team
dev-python/psycopg-3.3.4 fails to build with cython error
981457 - Assigned to Python Gentoo Team
dev-python/rq-2.11.0 fails tests: FAILED test_worker.py::TestWorkerSubprocess::test_run_scheduled_access_self - AssertionError: Job(55eef82c-f895-455c-bb58-4b16b74d30d6, enqueued_at=dat..
981498 - Assigned to Sam James
dev-lang/python-3.14.7: on hppa, spontaneous MemoryErrors in Portage, fails tests
981574 - Assigned to Python Gentoo Team
dev-python/apprise-1.13.1 fails tests: FAILED test_plugin_signalgrid.py::test_plugin_signalgrid_attach_warning - TypeError: One or more attachments could not be added
981714 - Assigned to Python Gentoo Team
dev-python/securesystemslib-1.5.0 fails several tests: Really update the preferences? (y/N) /usr/lib/python3.14/subprocess.py:1268: TimeoutExpired
981872 - Assigned to Python Gentoo Team
dev-python/anyioutils: removal
981891 - Assigned to Python Gentoo Team
dev-python/wxpython-4.2.5 - fails test_glcanvas.py::glcanvas_Tests, test_animate.py::animate_Tests
981945 - Assigned to Gentoo wxWidgets project
dev-python/numpy-2.5.1 - several ppc test failures due to AssertionError, OverflowError, TypeError
981946 - Assigned to Gentoo Science Related Packages
dev-python/pyenchant-3.3.0 - TestChunkersAndFilters::test_chunkter_only - AssertionError: assert 'com' == 'http'
982013 - Assigned to Python Gentoo Team
dev-python/amqp-5.3.1 fails tests: FAILED test_rmq.py::test_connect[plain] - ConnectionRefusedError: [Errno 111] Connection refused
982105 - Assigned to Python Gentoo Team
dev-python/py-landlock-0.1.1 fails tests: FAILED test_syscall_integration.py::TestLandlockSyscallIntegration::test_get_abi_errata_returns_int - py_landlock.errors.RulesetError: unknown flags, or unknown access, or unkno..
982136 - Assigned to Python Gentoo Team
app-misc/khal-0.14.0 with >=dev-python/urwid-4.0.5 TypeError: WidgetWrap.__init__() missing 1 required positional argument: 'w'
982159 - Assigned to Amy Liffey
dev-python/time-machine-3.5.1 adds -Werror flag on its own
982175 - Assigned to Python Gentoo Team
dev-python/multidict-6.8.0 fails tests: FAILED test_leaks.py::test_leak[multidict_extend_dict.py] - subprocess.CalledProcessError: Command multi..
982242 - Assigned to Python Gentoo Team
dev-python/tornado-6.5.9 breaks JupyterLab/Jupyter Server static file handling
982563 - Assigned to Python Gentoo Team
dev-python/overrides: removal
982608 - Assigned to Python Gentoo Team
app-admin/awscli-2.36.46[test] found directory that occludes package installed for python
982620 - Assigned to Python Gentoo Team
dev-python/nanobind-2.15.0 - fails to build tests on 32bit platforms: .../include/nanobind/eigen/dense.h:350:31: error: conversion from ‘int64_t’ {aka ‘long long int’} to ‘Eigen::Index’ {aka ‘int’} may change value
982846 - Assigned to Python Gentoo Team
dev-python/setuptools-scm-10.3.2 fails test testing_scm/test_regressions.py::test_pkginfo_noscmroot - assert 'setuptools-scm was unable to detect version for' in '[09/22/26 19:58:35] DEBUG in...
983128 - Assigned to Python Gentoo Team
dev-python/nanobind: missing include causes sci-ml/onnx-1.20.1 build failure with libcxx 23
983213 - Assigned to Python Gentoo Team
dev-python/typing-extensions-4.16.0: test_typing_extensions.py::LiteralTests::test_args fails
983258 - Assigned to Python Gentoo Team
sys-devel/gcc: miscompiles Cython with LTO (dev-python/cython-3.3.0 fails tests (both with and without USE=test-full))
983422 - Assigned to Gentoo Toolchain Maintainers
dev-python/fqdn-1.6.0 fails to compile: sphinx.errors.ExtensionError: Could not import extension myst_parser (exception: No module named myst_parser)
983478 - Assigned to Python Gentoo Team
dev-python/googleapis-common-protos-1.75.5 fails tests: FAILED test_operations.py::test_operations_servicer_interface - ModuleNotFoundError: No module named grpc
983552 - Assigned to Patrick McLean
dev-python/pyarrow-23.0.1 - error: binding reference of type ‘parquet::encryption::KmsConnectionConfig&’
983595 - Assigned to Tupone Alfredo
dev-python/anyio-4.15.1 fails tests TestTLSStream::test_receive_invalid_max_bytes test_tls_connectable: ValueError: server_hostname can only be specified in client mode
983625 - Assigned to Gentoo Science Related Packages
dev-lang/python-3.14.7[+tail-call-interp] - In file included from Python/ceval.c:1007: Python/ceval_macros.h:84:13: error: #error "This compiler does not have support for efficient tail calling."
983767 - Assigned to Python Gentoo Team
dev-python/pytest-asyncio-1.4.0 fails test tests/markers/test_class_scope.py::test_asyncio_mark_respects_the_loop_policy - AssertionError: assert {'passed': 2, 'skipped': 0, 'failed': 0, 'errors': 0, 'xpassed': 0, '...
983800 - Assigned to Python Gentoo Team
dev-python/polars-1.44.2 fails tests: FAILED test_user_guide.py::test_run_python_snippets[path28] - ModuleNotFoundError: No module named numba
983808 - Assigned to Python Gentoo Team
dev-python/lzallright-0.3.0 found directory that occludes package installed for python
983904 - Assigned to Sam James
dev-python/toml-fmt-common: removal
984202 - Assigned to Python Gentoo Team
dev-python/cramjam-2.14.0 Cargo.toml specified rust-version= which requires RUST_MIN_VER
984221 - Assigned to Python Gentoo Team
dev-python/wxpython-4.2.5: fails to build with app-text/doxygen-1.18.0 (Unable to find item named 'wxPGSortCallback')
984294 - Assigned to Gentoo wxWidgets project
dev-lang/python-3.16.0_alpha1: build error on musl 32-bit
984556 - Assigned to Python Gentoo Team
dev-python/execnet-2.1.2: Vagrant integration test incorrectly runs during package testing
984611 - Assigned to Andrey Grozin
dev-python/pycryptodome-4.1.0 fails test test_ec_common_bmi2_adx: trap invalid opcode
984627 - Assigned to Python Gentoo Team
dev-python/entrypoints: last rites
984696 - Assigned to Gentoo Science Related Packages
Stabilization Bug Reports
dev-python/ansicolor-0.3.3: stablereq
972062 - Assigned to Lucian Poston
dev-python/scipy-1.17.1: stablereq
972827 - Assigned to Gentoo Science Related Packages
dev-python/pymongo-4.17.0: stablereq
975911 - Assigned to Python Gentoo Team
dev-python/cvxopt-1.3.3: stablereq
976511 - Assigned to Gentoo Science Mathematics related packages
dev-python/twisted-26.4.0: stablereq
977331 - Assigned to Python Gentoo Team
dev-python/python-distutils-extra-3.3: stablereq
977815 - Assigned to Python Gentoo Team
dev-python/ipykernel-7.3.0, dev-python/nest-asyncio2-1.7.2: stablereq
979061 - Assigned to Gentoo Science Related Packages
dev-python/tables-3.11.1-r1: stablereq
980242 - Assigned to Python Gentoo Team
dev-python/xarray-2026.7.0: stablereq
980554 - Assigned to Python Gentoo Team
dev-python/pandas-3.0.5: stablereq
981195 - Assigned to Gentoo Science Related Packages
dev-python/matplotlib-3.11.1: stablereq
982382 - Assigned to Gentoo Science Related Packages
dev-python/pyarrow-25.0.1: stablereq
982400 - Assigned to Tupone Alfredo
dev-python/httpx2-2.12.0: stablereq
982774 - Assigned to Python Gentoo Team
dev-python/pythran-0.19.0: stablereq
982782 - Assigned to Python Gentoo Team
dev-python/mypy-2.3.1: stablereq
982831 - Assigned to Python Gentoo Team
dev-python/nanobind-3.0.1: stablereq
983314 - Assigned to Python Gentoo Team
dev-python/djangorestframework-3.18.1: stablereq
983946 - Assigned to Python Gentoo Team
dev-embedded/platformio-6.1.19-r2: Stablereq
984095 - Assigned to Bill Prendergast
app-admin/awscli-2.37.13 and friends: stablereq
984348 - Assigned to Python Gentoo Team
dev-python/setuptools-scm-10.3.2: stablereq
984371 - Assigned to Python Gentoo Team
dev-python/time-machine-3.5.1: stablereq
984375 - Assigned to Python Gentoo Team
dev-python/fakeredis-2.38.0: stablereq
984381 - Assigned to Python Gentoo Team
dev-python/pygobject-3.50.2: stablereq
984397 - Assigned to Gentoo Linux Gnome Desktop Team
dev-python/pikepdf-10.13.0_p1: stablereq
984401 - Assigned to Andrey Grozin
dev-python/grpcio-1.84.0: stablereq
984412 - Assigned to Python Gentoo Team
dev-python/grpcio-status-1.84.0: stablereq
984413 - Assigned to Python Gentoo Team
dev-python/mysqlclient-2.3.0: stablereq
984444 - Assigned to Matthew Thode ( prometheanfire )
dev-python/selenium-4.49.0: stablereq
984445 - Assigned to Python Gentoo Team
dev-python/psycopg-3.3.6: stablereq
984448 - Assigned to Python Gentoo Team
dev-python/numpy-2.5.3: stablereq
984453 - Assigned to Gentoo Science Related Packages
dev-python/ensurepip-pip-26.2.2, dev-python/pip-26.2.2: stablereq
984658 - Assigned to Python Gentoo Team
app-arch/brotli-1.2.1 stable request
984711 - Assigned to Craig Andrews
Keywording Bug Reports
app-admin/eclean-kernel: keyword
891511 - Assigned to Michał Górny
sci-ml/huggingface_hub: add ~ppc64 keyword
953434 - Assigned to Tupone Alfredo
sci-mathematics/manifold: x86 arm64 ppc64 rekeywording
955276 - Assigned to Paul Zander
dev-python/cmd2: rekeyword
959351 - Assigned to Matthew Thode ( prometheanfire )
app-text/psutils: re-keywording request
959720 - Assigned to TeX project
dev-python/pip-25.3, dev-python/pipx-1.8.0, and deps seem to work on x64-macos
969531 - Assigned to Gentoo Linux bug wranglers
app-backup/duplicity: ~arm keywording
969737 - Assigned to Sam James
dev-python/dj-database-url: rekeyword
970341 - Assigned to Python Gentoo Team
dev-python/sphinx-autodoc-typehints: rekeyword
970614 - Assigned to Python Gentoo Team
dev-python/pytest-jobserver: keywording
974566 - Assigned to Python Gentoo Team
dev-python/scikit-learn: rekeyword
978745 - Assigned to Gentoo Science Related Packages
=app-misc/khard-0.21.0: re-keyword arm
978756 - Assigned to No maintainer - Look at https://wiki.gentoo.org/wiki/Project:Proxy_Maintainers if you want to take care of it
dev-util/diffoscope: rekeyword request for ppc64
978858 - Assigned to Sam James
dev-python/python-openstackclient: rekeyword
979212 - Assigned to Matthew Thode ( prometheanfire )
media-libs/fontconfig: rekeywording
979257 - Assigned to Gentoo Fonts Team
dev-python/jupyterlab-4.6 rekeyword request
979422 - Assigned to Gentoo Science Related Packages
llvm-core/clang-22.1.8 ~s390 keywording
979778 - Assigned to LLVM support project
dev-python/feedparser: rekeyword
980169 - Assigned to Python Gentoo Team
dev-python/py: rekeyword
980260 - Assigned to Python Gentoo Team
dev-python/s3transfer: rekeyword
980437 - Assigned to Patrick McLean
dev-python/yaxmldiff: rekeyword
980644 - Assigned to Patrick McLean
dev-python/ipywidgets: rekeyword
981055 - Assigned to Gentoo Science Related Packages
dev-python/cachelib: rekeyword
981311 - Assigned to Python Gentoo Team
dev-python/python-slugify: rekeyword
982168 - Assigned to Robert G. Siebeck
dev-python/awscrt: keywordreq
982455 - Assigned to Python Gentoo Team
dev-python/netcdf4: keywordreq
982459 - Assigned to Gentoo Science Related Packages
dev-python/pyarrow and friends: keywordreq
982461 - Assigned to Tupone Alfredo
dev-python/pytest-env: keywordreq
982462 - Assigned to Python Gentoo Team
dev-python/narwhals: keywordreq
982463 - Assigned to Python Gentoo Team
dev-python/anyascii: keywordreq
982468 - Assigned to Python Gentoo Team
app-admin/awscli: keywordreq
982575 - Assigned to Python Gentoo Team
net-im/gajim, dev-python/pysequoia: keywordreq
982737 - Assigned to Python Gentoo Team
dev-python/xmlsec: keywordreq
983453 - Assigned to Patrick McLean
dev-python/requests-mock: keywordreq
983455 - Assigned to Python Gentoo Team
dev-python/zeep: keywordreq
983456 - Assigned to Python Gentoo Team
dev-python/python-stdnum: keywordreq
983457 - Assigned to Python Gentoo Team
dev-python/faker: keywordreq
983458 - Assigned to Bernard Cafarelli
dev-python/httpx-aiohttp: keywordreq
983805 - Assigned to Thibaud CANALE
dev-python/cloudflare: keywordreq
983806 - Assigned to Thibaud CANALE
dev-python/dnspython, dev-python/uv-build, dev-python/uv: keywordreq
983931 - Assigned to Python Gentoo Team
dev-python/pyte: keywordreq
984186 - Assigned to Python Gentoo Team
dev-python/rich-argparse: keywordreq
984187 - Assigned to Python Gentoo Team
dev-python/sphinx-autodoc-typehints, dev-python/annotated-doc: keywordreq
984523 - Assigned to Python Gentoo Team
Description
Gentoo Bugzilla is where we track bugs of Gentoo and its packages; you are welcome to report, confirm and resolve bugs:
File a new Bug
Confirm a bug
Participate in our monthly Bugday
Shortcuts
Packages Bugs (893)
Stabilization Bugs (32)
Keywording Bugs (43)