Packages
Get Gentoo!
gentoo.org sites
gentoo.org
Wiki
Bugs
Forums
Packages
Planet
Archives
Sources
Infra Status
Home
Packages
Maintainers
USE flags
Architectures
About
Gentoo Developer
Sam James
Packages
256
Stabilization
7
Outdated
26
Pull requests
0
Bugs
271
Security
30
Changelog
Bug Reports
net-analyzer/nmap bundles dev-libs/libdnet dev-libs/libpcre net-libs/libpcap liblinear
253269 - Assigned to Sam James
app-admin/gkrellm-2.3.4 and kde-4.3 - Invisible theme isn't invisible
303853 - Assigned to Sam James
app-admin/gkrellm-2.3.4: sensors stop updating after it's been running for some time
327685 - Assigned to Sam James
app-admin/gkrellm - chart rendering bug
438872 - Assigned to Sam James
net-vpn/tor systemd service requires CAP_SYS_RESOURCE
534014 - Assigned to John Helmert III
net-vpn/tor: allow more than one tor instance
547068 - Assigned to John Helmert III
mail-filter/postgrey: root privilege escalation via init script race condition
603258 - Assigned to Gentoo Security
media-sound/pulseaudio LICENSE metadata and expressing license strictening due to linkage or not
614154 - Assigned to Licenses team
media-sound/pulseaudio running under gnome-base/gdm - breaking at least zeroconf setup
642198 - Assigned to Igor V. Kovalenko
app-admin/gkrellm-2.3.10-r1 - fails to start with "IA__gtk_box_reorder_child: assertion 'GTK_IS_WIDGET (child)' failed"
668484 - Assigned to Sam James
dev-db/redis: add systemd support for multiple instances
670144 - Assigned to Petr Vaněk
sys-fs/zfs-0.7.9: init script "zfs-import" has weird output for "status"
672128 - Assigned to Sam James
net-irc/quassel openrc init script wrongly forces listening only on ipv4
673010 - Assigned to Sam James
net-irc/quassel: useless REQUIRED_USE constraints
673680 - Assigned to Sam James
net-vpn/tor - /etc/init.d/tor should show what is actually wrong with config on checkconfig
674658 - Assigned to John Helmert III
net-vpn/tor-0.3.4.9 - /var/lib/tor/data/control_auth_cookie inaccessible to unprivileged users
678154 - Assigned to John Helmert III
net-vpn/tor: can't read its own files when run via systemd service
694986 - Assigned to John Helmert III
net-vpn/tor should use CacheDirectory by default
706430 - Assigned to John Helmert III
net-vpn/tor: seccomp not enabled by USE flag
713690 - Assigned to John Helmert III
dev-db/redis-4.0.14: [err]: Server is able to generate a stack trace on selected systems in tests/integration/logging.tcl
714036 - Assigned to Petr Vaněk
sys-fs/zfs: Add support for Intel QuickAssist (QAT) acceleration
718026 - Assigned to Sam James
x11-themes/gkrellm-themes-0.1-r2 installs files with broken symlink
726266 - Assigned to Sam James
net-irc/unrealircd-5.2.3 fails to compile: undefined symbol: ioctlsocket
731198 - Assigned to Sam James
x11-plugins/gkrellaclock-0.3.4-r2 does not respect CFLAGS
742836 - Assigned to Sam James
x11-plugins/gkrellfire-0.4.2-r2 does not respect CFLAGS
742839 - Assigned to Sam James
x11-plugins/gkrellm-cpupower-0.2-r1 does not respect LDFLAGS
742905 - Assigned to Sam James
x11-plugins/gkrelltop-2.2.13-r3[-X]: failed (install phase): !!! doexe: gkrelltop.so does not exist
742917 - Assigned to Sam James
dev-libs/tomsfastmath-0.13.1 fails to compile when changing CC
745837 - Assigned to Sam James
net-vpn/tor - make init-r9 file more generic
756079 - Assigned to John Helmert III
net-dns/dnscrypt-proxy log rotation should have a hard restart
763495 - Assigned to Sam James
sys-fs/zfs-kmod should warn if CONFIG_HIBERNATION set in kernel
773649 - Assigned to Sam James
dev-libs/libtomcrypt-1.18.2-r2 rlibtool: error logged in slbt_lconf_open(), line 73: flow error: unexpected condition or other. when using rlibtool
777084 - Assigned to Sam James
sys-auth/pambase: pam_mktemp.so is loaded after pam_env.so
780441 - Assigned to Gentoo's Team for Core System packages
media-video/pipewire should not suggest adding users to the audio group
801601 - Assigned to Sam James
media-video/pipewire-0.3.31 Missing atomic symbol when building pipewire with jack support using clang/lld
802162 - Assigned to Sam James
net-analyzer/netcat: use flag for execute option?
806450 - Assigned to Sam James
app-emulation/qemu-guest-agent-6.0.0 startup script shows no error despite failure
810628 - Assigned to John Helmert III
app-forensics/aflplusplus-3.14c-r2 - clang-12: error: invalid integral value 32:25:16 in -falign-functions=32:25:16
813849 - Assigned to Sam James
sys-fs/zfs-kmod-2.1.1 error: implicit declaration of function ‘__init_rwsem’ when building vs. rt-sources-5.14.2-rt21
815109 - Assigned to Sam James
net-misc/chrony: Failed to load seccomp rules
815472 - Assigned to Sam James
media-video/pipewire-0.3.39 does not have an option to disable building pipewire-v4l2
820116 - Assigned to Sam James
media-video/pipewire: No sound, wireplumber fails to start when launching gentoo-pipewire-launcher
822498 - Assigned to Sam James
sys-apps/zram-generator-1.1.1 fails tests
828472 - Assigned to Sam James
media-sound/pulseaudio-15.0-r1 fails to build multilib with clang
829764 - Assigned to Gentoo Toolchain Maintainers
media-sound/pulseaudio: Adjusting volume using pavucontrol with locked channels only affects some audio channels (Upstream?)
830608 - Assigned to Igor V. Kovalenko
sys-apps/uutils-coreutils-0.0.14 does not respect LDFLAGS
832502 - Assigned to Luca Barbato
media-video/pipewire should add an EWARN for CONFIG_SND_VERBOSE_PROCFS
832885 - Assigned to Sam James
net-irc/unrealircd-6.0.2 - invite.c: error: MODE_SECRET undeclared (first use in this function)
833307 - Assigned to Sam James
mail-filter/postgrey-1.37: couldn't unlink "/var/run/postgrey.pid"
833450 - Assigned to Sam James
net-analyzer/fail2ban: init script with --quiet parameter is not quiet
833803 - Assigned to Sam James
dev-libs/libxml2-2.9.14-r1 fails tests on MUSL
834365 - Assigned to Sam James
media-video/pipewire broke, no output devices, missing systemd user
834871 - Assigned to Sam James
dev-python/redis-4.1.4 fails tests on MUSL
834883 - Assigned to Sam James
dev-python/rq-1.11 fails tests on MUSL
834886 - Assigned to Sam James
media-gfx/mypaint-2.0.1-r2 fails tests on MUSL
836232 - Assigned to Sam James
net-irc/quassel-0.14.0-r1 fails tests on MUSL
836624 - Assigned to Sam James
net-vpn/tor-0.4.7.10 fails tests on MUSL
836745 - Assigned to John Helmert III
sys-apps/uutils-coreutils-0.0.13 fails tests
836764 - Assigned to Luca Barbato
dev-libs/crypto++ - add multilib support
845276 - Assigned to Sam James
media-video/wireplumber: Failed to set scheduler settings: Operation not permitted
849113 - Assigned to Sam James
dev-db/redis openrc creates second pid file separate from redis
851036 - Assigned to Petr Vaněk
net-irc/quassel-0.14.0-r1 - CMake Error: The following variables are used in this project, but they are set to NOTFOUND.
855899 - Assigned to Gentoo musl team
dev-db/redis-6.2.7-r1 fails tests on stable arm64
857861 - Assigned to Petr Vaněk
dev-db/redis-6.2.7-r1 fails tests on stable sparc
857864 - Assigned to Petr Vaněk
app-forensics/aflplusplus-4.01c-r1 - src/afl-ld-lto.c: error: PATH_MAX undeclared (first use in this function)
862348 - Assigned to Gentoo musl team
sys-auth/pambase: /etc/pam.d/runuser includes pam_env.so twice
863884 - Assigned to Gentoo's Team for Core System packages
media-libs/libpulse-16.1 hard-depends on either PulseAudio or PipeWire sound servers (should cater to media-sound/apulse somehow)
867277 - Assigned to Igor V. Kovalenko
media-video/wireplumber-0.4.11-r3: wireplumber need libcamera
867670 - Assigned to Sam James
app-forensics/aflplusplus-4.06c does not respect LDFLAGS
867826 - Assigned to Sam James
net-dns/dnscrypt-proxy-2.1.1: logrotate fails due to permission problems in combination with systemd service
869872 - Assigned to Sam James
net-analyzer/fail2ban systemd iptables-restore.service failed sometimes when fail2ban set ipset to ban IPs
871996 - Assigned to Sam James
net-irc/ergo-2.10.0 fails tests (MUSL)
872008 - Assigned to Sam James
dev-db/redis-7.0.5: fails tests on x86
872782 - Assigned to Petr Vaněk
net-analyzer/netcat is soft blocking net-analyzer/openbsd-netcat-1.195
875161 - Assigned to Sam James
sys-devel/mold-1.5.1 fails tests (MUSL): 229 - x86_64-version.sh (Failed)
875839 - Assigned to Sam James
sys-libs/libfaketime-0.9.10 fails tests (MUSL) (functests/test_walkone.sh, libfaketime: In parse_ft_string(), failed to parse FAKETIME timestamp.)
876067 - Assigned to Sam James
net-misc/openrsync: possible configure breakage with Clang 16
879743 - Assigned to Sam James
dev-db/redis-7.0.5-r1: failed (test phase)
881277 - Assigned to Petr Vaněk
sys-fs/zfs-kmod-2.1.7 fails to emerge on arm64 (modpost: "mutex_lock"), caused by debug lock config options?
884299 - Assigned to Sam James
dev-util/cproto-4.7u fails to compile (CLANG-STRICTER-SYSTEM): clang-15: error: no such file or directory: y.tab.c
884483 - Assigned to Sam James
sys-apps/uutils-coreutils-0.0.15 fails test - test test_df::test_file_column_width_if_filename_contains_unicode_chars FAILED
885557 - Assigned to Luca Barbato
sys-libs/pam: proposal for new defaults for pam_limits
885589 - Assigned to Gentoo's Team for Core System packages
sys-apps/edac-utils-0.18-r2 fails to compile: libedac.c:456:5: error: __builtin_strncpy output may be truncated copying 63 bytes from a string of length 63 [-Werror=stringop-truncation]
888938 - Assigned to Sam James
dev-libs/libtomcrypt: cross-compiling fails with wrong linker command
889202 - Assigned to Sam James
net-irc/unrealircd-6.0.4.2 startup issues (with openrc)
890338 - Assigned to Sam James
dev-db/redis-7.0.8: failed (test phase) (x86)
891373 - Assigned to Petr Vaněk
sys-fs/zfs-9999: uses conf.d files in systemd units
892269 - Assigned to Sam James
dev-util/py-spy-0.3.14 calls cc directly
892555 - Assigned to Sam James
>=media-video/pipewire-3.53_p20220704-r1: media-plugins/alsa-plugins[pulseaudio] will be uninstalled when migrating from pulseaudio
892826 - Assigned to Sam James
media-video/pipewire: Enforce CONFIG_SND_PROC_FS=y Kernel config option
893228 - Assigned to Sam James
media-video/pipewire USE=pipewire-alsa should be described differently
893412 - Assigned to Sam James
sys-devel/mold-1.10.1 - fails x86_64-version test whereas this test passes when testsuite is run from git
894260 - Assigned to Sam James
dev-util/py-spy-0.3.14 - error: failed to run custom build command for remoteprocess v0.4.10
894630 - Assigned to Gentoo musl team
net-irc/irker-2.23: fails to build docbooks
895742 - Assigned to Sam James
media-gfx/graphicsmagick-1.3.42 fails to compile (MUSL-CLANG-SYSTEM): clang-16: error: unsupported option -p for target x86_64-gentoo-linux-musl
896216 - Assigned to Sam James
net-irc/unrealircd-6.0.4.2 fails to compile (MUSL-CLANG-SYSTEM): clang-16: error: unable to make temporary file: No such file or directory
897868 - Assigned to Sam James
sys-apps/edac-utils-0.18-r2 fails to compile (MUSL-CLANG-SYSTEM): split.c:43:51: error: comparing a pointer to a null character constant
898544 - Assigned to Sam James
sys-devel/mold-1.10.1 - packages built with mold fail with: crtbeginS.o:(.text): cannot find a symbol in .opd for R_PPC64_REL24 at offset 0x0 because of stripped sys-devel/gcc
899974 - Assigned to Sam James
net-misc/openrsync-0.5.0_p20220508 has implicit function declarations in configure logs (GCC-13-SYSTEM)
900302 - Assigned to Sam James
media-video/pipewire-0.3.67 - ../.../meson.build: ERROR: Dependency avahi-client not found, tried pkgconfig and cmake
901237 - Assigned to Sam James
x11-plugins/gkrellmss-2.6-r5 - emerge hangs during configure
903693 - Assigned to Sam James
sys-fs/zfs-kmod should not always require CONFIG_MODULES
904087 - Assigned to Sam James
sys-fs/zfs-2.3.0 adds -Werror flag on its own
904378 - Assigned to Sam James
sys-fs/zfs-kmod-2.2.6 has implicit function declarations in configure logs
904379 - Assigned to Sam James
net-irc/unrealircd-6.0.7 version bump plus use flag for geoip_classic module
905139 - Assigned to Sam James
sys-auth/pambase: pam_limits don't get applied after login from tty when enforcing
905302 - Assigned to SE Linux Bugs
sys-auth/pambase: please consider using a safer password hashing function by default (e.g. yescrypt)
905678 - Assigned to Gentoo's Team for Core System packages
net-vpn/tor: make the openrc script ready for multi-relay
905788 - Assigned to Sam James
dev-libs/libxslt-1.1.38 fails tests (MUSL-SYSTEM) (REC2 tests, Compare error at position 37)
906538 - Assigned to Sam James
dev-util/py-spy-0.3.14 - .../fs.rs:1538: undefined reference to stat64
907037 - Assigned to Gentoo musl team
media-gfx/graphicsmagick-1.3.42 fails to compile (MUSL-SYSTEM): ld: cannot find gcrt1.o: No such file or directory
907216 - Assigned to Sam James
media-video/pipewire-0.3.70-r2 points to wrong wiki documentation
907272 - Assigned to Sam James
media-video/pipewire problems when restarting Kde Sessions
907769 - Assigned to Sam James
sys-fs/libeatmydata-131 fails to compile (MUSL-SYSTEM): libeatmydata.c:47:44: error: unknown type name off64_t
908665 - Assigned to Sam James
sys-fs/zfs-2.1.12 fails to compile (MUSL-SYSTEM): sysmacros.h:101: error: "_NOTE" redefined [-Werror]
908667 - Assigned to Sam James
sys-libs/libfaketime-0.9.10 fails to compile (MUSL-SYSTEM): libfaketime.c:926:42: error: invalid use of undefined type struct stat64
908668 - Assigned to Sam James
dev-util/diffoscope-243 fails tests: test_python.py::test_diff Fatal Python error: Aborted
909088 - Assigned to Sam James
sys-fs/zfs-kmod: ebuild requires build kernel before building module into kernel source tree
909202 - Assigned to Sam James
net-analyzer/fail2ban-1.0.2-r2: still breaks umask after running tests?
910460 - Assigned to Sam James
dev-libs/liblinear-246: 404 on fetch attempt
911626 - Assigned to Sam James
net-firewall/firewalld-2.0.0 - UnicodeEncodeError: 'latin-1' codec can't encode character '\u2018' in position 122: ordinal not in range(256)
913766 - Assigned to Virtualization Team
media-libs/roc-toolkit-0.4.0 calls cc directly
913850 - Assigned to Sam James
dev-libs/libsodium-1.0.19 - !!! Couldnt download .layout.conf.129.143.116.10. Aborting.
914167 - Assigned to Sam James
media-video/pipewire should create /etc/pipewire/pipewire.conf.d/
917084 - Assigned to Sam James
dev-python/leechcorepyc-2.16.9 - [clang] oscompatibility.c: error: address argument to atomic operation must be a pointer to _Atomic type (uint32_t (aka unsig
918955 - Assigned to
net-irc/unrealircd-6.0.4.2 - [clang] configure: error: in /.../unrealircd-6.0.4.2:
919194 - Assigned to Sam James
net-irc/unrealircd-6.0.4.2 - [clang] dispatch.c: error: call to undeclared function ioctlsocket; ISO C99 and
919578 - Assigned to Sam James
sys-fs/zfs-2.2.2: init script "zfs-import" doesn't implement stop() and can't properly deactivate zpool during shutdown
919696 - Assigned to Sam James
media-libs/libopenaptx-0.2.0-r1 - [clang] ld.lld: error: undefined symbol: _unordtf2
919828 - Assigned to Sam James
[pentoo] net-analyzer/nmap-7.94 fails to compile ac_fn_c_try_cpp: command not found preprocessor "x86_64-pc-linux-gnu-gcc -E" fails sanity check ./configure failed for libdnet-stripped
922117 - Assigned to Rick Farina (Zero_Chaos)
sys-libs/pkgcraft-0.0.13 fails to compile: Error: CliError { error: Some(1 job failed), exit_code: 101 }
923077 - Assigned to Sam James
net-analyzer/fail2ban-1.1.0-r2 installs deprecated .egg/.egg-info
923080 - Assigned to Sam James
sys-fs/zfs-kmod-2.3.0 [debug] fails to compile: ldo.c:181:9: error: infinite recursion detected [-Werror=infinite-recursion]
923280 - Assigned to Sam James
sys-apps/zram-generator-1.1.2 - /.../ronn:9:in load: cannot load such file -- .../ronn (LoadError)
923401 - Assigned to Sam James
dev-util/elfshaker-0.9.0_p20240122 fails to compile: util_libc.rs:150:(.text._ZN9getrandom9util_libc13open_readonly17hd90c5f0ed2bf6dddE+0x4a): undefined reference to open64
923769 - Assigned to Sam James
dev-python/sympy-1.12-r1 fails tests: Fatal Python error: Segmentation fault
924016 - Assigned to Andrey Grozin
media-libs/openfec-1.4.2.9 fails tests: 3 - code_params (Failed)
924147 - Assigned to Sam James
dev-libs/crypto++-8.9.0 installs files that contain a TEXTREL
924207 - Assigned to Sam James
dev-util/cargo-nextest-0.9.67 fails to compile: error: cannot produce proc-macro for async-trait v0.1.74 as the target x86_64-unknown-linux-musl does not support these crate types
924217 - Assigned to Sam James
net-libs/rustls-ffi-0.10.0-r1 fails tests: thread main panicked at debug_asserts.rs:540:13:
924421 - Assigned to Sam James
net-misc/trurl-0.7 fails tests
924598 - Assigned to Sam James
sys-libs/pkgcraft-0.0.14 fails to compile: make LIBTOOL=rlibtool: line 1: exec: make LIBTOOL=rlibtool: not found
924924 - Assigned to Sam James
sys-apps/zram-generator-1.1.2 fails to compile: util_libc.rs:110:(.text._ZN9getrandom9util_libc13open_readonly17h0d8cf81fdad2aee3E+0x4a): undefined reference to open64
925155 - Assigned to Sam James
sys-libs/pam: pam_lastlog is not present on musl systems
925222 - Assigned to Gentoo's Team for Core System packages
dev-vcs/git-extras-7.3.0 problems with installed bash completions
925301 - Assigned to Sam James
dev-util/pkgcruft-0.0.1 fails to compile: make LIBTOOL=rlibtool: line 1: exec: make LIBTOOL=rlibtool: not found
925359 - Assigned to Sam James
media-video/pipewire: Invalid wiki URL in the Pipewire article
925521 - Assigned to Sam James
app-admin/gkrellm-2.3.11-r4 fails to compile: cp: cannot create regular file gkrellmpc.mo: No such file or directory
925690 - Assigned to Sam James
net-misc/bopm-3.1.3-r7 installs empty directories
926127 - Assigned to Sam James
sys-apps/pkgcraft-tools-0.0.14 fails to compile: make LIBTOOL=rlibtool: line 1: exec: make LIBTOOL=rlibtool: not found
926635 - Assigned to Sam James
sys-fs/zfs-2.2.3 fails to compile: zfs_debug.h:92:9: error: dprintf macro redefined [-Werror,-Wmacro-redefined]
926645 - Assigned to Sam James
sys-libs/libfaketime-0.9.10 fails to compile: ld.lld: error: version script assignment of GLIBC_2.2 to symbol timer_gettime failed: symbol not defined
926646 - Assigned to Sam James
sys-libs/pkgcraft-0.0.14 fails to compile: thread main panicked at lib.rs:620:31:
927005 - Assigned to Sam James
net-misc/iperf-2.1.9 version bump
927401 - Assigned to Sam James
dev-python/leechcorepyc-2.18.0: randomly installs more files ?
927950 - Assigned to
net-libs/rustls-ffi-0.12.1-r2 fails to compile: Error: CliError { error: Some(cannot produce cdylib for rustls-ffi v0.12.1 rustls-ffi-0.12.1-abi_x86_64.amd64) as the target x86_64-unknown-linux-musl does not support these crate types), exit_code: 101 }
928118 - Assigned to Sam James
x11-plugins/gkrellsun-1.0.0-r5 - !!! doexe: src20/gkrellsun.so does not exist
928392 - Assigned to Sam James
sys-fs/zfs-2.2.3 fails to compile: zpool_vdev_os.c:441:29: error: calloc sizes specified with sizeof in the earlier argument and not in the later argument [-Werror=calloc-transposed-args]
928518 - Assigned to Sam James
sys-apps/plocate-1.1.22 fails to compile: stat.h:56:8: error: redefinition of struct statx_timestamp
928568 - Assigned to Jeffrey Lin
app-forensics/yara-4.4.0 fails tests: test-driver: line 112: 1537 Aborted $@ >> $log_file 2>&1
928931 - Assigned to
sys-libs/pkgcraft-0.0.14 - 915 | test_syntax_error (_(syntax error: %s unexpected), argv[pos]);
929131 - Assigned to Gentoo musl team
net-proxy/sqtop-2015.02.08 - [clang] sqstat.cpp: error: use of undeclared identifier ptr_fun
929259 - Assigned to Jaco Kroon
media-video/pipewire: Add 'realtime' local USE flag?
929264 - Assigned to Sam James
app-emulation/qemu-guest-agent-8.2.0 - ERROR: python venv creation failed
930254 - Assigned to John Helmert III
media-sound/pulseaudio-daemon-17.0-r1 fails tests: cpu-volume-test FAIL 1.13s exit status 1 - cpu-volume-test.c:188:E:svolume:svolume_orc_test:0: (after this point) Received signal 11 (Segmentation fault)
930409 - Assigned to Igor V. Kovalenko
sys-libs/pam: wire up econf support
931117 - Assigned to Gentoo's Team for Core System packages
>=sys-fs/zfs-2.2.0 missing dependency on net-misc/curl
931502 - Assigned to Sam James
media-video/pipewire: misleading description for USE=liblc3
931549 - Assigned to Sam James
app-forensics/yara-4.5.0 - /.../ld: ./.../libyara.so: undefined reference to pread64
931595 - Assigned to Gentoo musl team
x11-plugins/gkrellm-radio-2.0.4-r2 - gkrellm_radio_lirc.c: error: passing argument 3 of gdk_input_add_full from incompatible pointer type [-Wincompati
932456 - Assigned to Sam James
app-forensics/aflplusplus-4.08c-r1 - [ncurses-6.5] [gcc-15] [llvm] ./split-switches-pass.so: ./split-switches-pass.so: undefined symbol:
932543 - Assigned to Sam James
dev-util/diffoscope: consider dropping or masking USE=gif due to problematic media-libs/giflib dependency
933162 - Assigned to Sam James
net-analyzer/nmap fails tests with python-3.12
933471 - Assigned to Sam James
app-text/xmlto: Bump to 0.0.29
934593 - Assigned to Sam James
sys-fs/zfs-2.2.4 fails to compile: nvpair.c:1259:17: error: writing 4 bytes into a region of size 0 [-Werror=stringop-overflow=]
934626 - Assigned to Sam James
dev-python/sympy is masked on ppc64 23.0 profile but message suggests it should not be
934761 - Assigned to matoro
dev-libs/hiredis-1.2.0 fails tests: #62 Returns error when host cannot be resolved: FAILED
935528 - Assigned to Sam James
dev-libs/pocl-6.0 - [perl-5.40] [icu-75.1] /.../pocl_mem_management.c: error: cmd undeclared (first use in this function)
935756 - Assigned to Sam James
sys-libs/pkgcraft-0.0.16-r1 fails to compile: thread main panicked at lib.rs:622:31:
936004 - Assigned to Sam James
app-crypt/sequoia-sq-0.37.0 fails tests: error: test failed, to rerun pass --test sq-autocrypt
936577 - Assigned to Florian Schmaus
net-irc/unrealircd-6.0.4.2 - [perl-5.40] [icu-75.1] [gcc-15] join.c: error: MODE_SECRET undeclared (first use in this function)
936579 - Assigned to Sam James
sys-fs/zfs-2.2.3 QA Notice: The following deprecated .egg or .egg-info files were found.
937228 - Assigned to Sam James
sys-apps/bfs-3.3.1 fails tests
937373 - Assigned to Sam James
sys-apps/uutils-findutils-0.5.0 fails tests: error: test failed, to rerun pass --lib
937433 - Assigned to Luca Barbato
dev-libs/botan-3.2.0-r1 file collision with dev-libs/botan-2.19.3-r2: /usr/share/man/man1/botan.1.bz2
937630 - Assigned to Sam James
sys-apps/pkgcraft-tools-0.0.16 - 915 | test_syntax_error (_(syntax error: %s unexpected), argv[pos]);
938142 - Assigned to Gentoo musl team
app-crypt/sequoia-sq-0.37.0 - error: failed to run custom build command for nettle-sys v2.3.0
938144 - Assigned to Gentoo musl team
dev-debug/dtrace-2.0.1.1-r2 installs files that contain writable and executable sections
938221 - Assigned to Sam James
media-video/pipewire-1.0.7-r1 has automagic dependency on media-libs/libpulse
938235 - Assigned to Sam James
app-crypt/sequoia-sqv-1.2.1 - error: failed to run custom build command for nettle-sys v2.3.0
938272 - Assigned to Gentoo musl team
sys-fs/zfs-2.2.5 QA Notice: setuptools warnings detected:
938304 - Assigned to Sam James
app-crypt/sequoia-chameleon-gnupg-0.10.1 - error: failed to run custom build command for nettle-sys v2.3.0
938323 - Assigned to Gentoo musl team
dev-libs/pocl-6.0 - [gcc-15] /.../spirv_parser.cc: error: struct SPIRVParser::OCLArgTypeInfo has no member named Alignment
938487 - Assigned to Sam James
sys-auth/pambase-20240128 add pam_umask.so
938574 - Assigned to Gentoo's Team for Core System packages
dev-python/leechcorepyc-2.18.7 installs more files with FEATURES=test
938671 - Assigned to
sys-fs/zfs-2.3.0 fails to compile: zpool_vdev_os.c:100:10: error: initializer-string for array of char is too long [-Werror=unterminated-string-initialization]
939506 - Assigned to Sam James
dev-debug/dtrace-2.0.1.1-r2 fails to compile: drti.c:81:9: error: unknown type name Lmid_t
939569 - Assigned to Sam James
dev-libs/libkdumpfile-0.5.4-r1 fails tests: test-blob.c:68:9: error: implicit declaration of function mallopt [-Wimplicit-function-declaration]
939582 - Assigned to Sam James
sys-auth/pambase: please drop pam_shells from /etc/pam.d/system-login
939892 - Assigned to Gentoo's Team for Core System packages
sys-devel/mold-2.32.1 one test fails : x86_64-pack-dyn-relocs-relr
939954 - Assigned to Sam James
dev-python/leechcorepyc-2.18.7 installs files that contain a TEXTREL
940519 - Assigned to
sys-process/parallel: PERL_FEATURES=ithreads should be required
940683 - Assigned to Sam James
dev-util/unicorn-2.0.1 calls strings directly
940715 - Assigned to
app-doc/gnu-c-intro-ref-0_pre20240831 fails tests: You dont have a working TeX binary (tex) installed anywhere
940739 - Assigned to Sam James
net-firewall/firewalld complains about CONFIG_NF_CT_NETLINK_HELPER not being set when using sys-kernel/gentoo-kernel-bin
941072 - Assigned to Virtualization Team
media-gfx/graphicsmagick-1.3.45-r1 - [ncurses-6.5] [libtool] [gcc-15] /.../ora.ver:2: syntax error in VERSION script
941080 - Assigned to Sam James
dev-db/recutils-1.9 - [ncurses-6.5] [meson] [libtool] [gcc-15] /.../ld: ../.../librec.so: undefined reference to curl_easy_setopt
941132 - Assigned to Sam James
net-misc/chrony installs an executable .keep file
941137 - Assigned to Sam James
sys-devel/mold: make mimalloc an optional dependency via USE=mimalloc
941189 - Assigned to Sam James
net-firewall/firewalld-2.2.1-r1: wrong log path (/var/lib/log/firewalld) in logrotate config
941284 - Assigned to Virtualization Team
dev-db/redis-7.4.1 fails tests
941297 - Assigned to Petr Vaněk
sys-apps/uutils-coreutils-0.0.27 fails test - [libtool] [gcc-15] test test_cp::test_cp_debug_default_sparse_virtual_file FAILED
941580 - Assigned to Luca Barbato
x11-plugins/gkrellm-bluez-0.2-r3 - [libtool] [gcc-15] checking for GKRELLM... configure: error: Package requirements (gkrellm) were not met:
941783 - Assigned to Sam James
net-analyzer/wireshark: fails tests with LTO
941890 - Assigned to Sam James
dev-util/pkgcruft-0.0.3 fails tests: source.rs:42:(.text._ZN7scallop6source4file28_$u7b$$u7b$closure$u7d$$u7d$17h6a78cfccea3fb4efE+0x35): undefined reference to scallop_source_file
942113 - Assigned to Sam James
dev-db/recutils-1.9 - [gcc-15] /.../ld: ../.../librec.so: undefined reference to curl_easy_init
942210 - Assigned to Gentoo musl team
dev-libs/botan-2.19.3-r2 - [gcc-15] src/.../cli.h: error: uint8_t does not name a type
942814 - Assigned to Sam James
net-libs/rustls-ffi-0.14.0 fails test - Error: CliError { error: Some(1 job failed), exit_code: 101 }
943330 - Assigned to Sam James
sys-apps/pkgcraft-tools-0.0.16-r1 fails tests: functions.rs:46:(.text._ZN7scallop9functions4find17h09715f196be21002E+0x101): undefined reference to find_function
943724 - Assigned to Sam James
app-admin/gkrellm-2.3.11-r4 - [libtool] [gcc-15] battery.c: error: passing argument 2 of gkrellm_alert_trigger_connect from incompatible pointer type [-Wincompatible-poin
943935 - Assigned to Sam James
x11-plugins/i8krellm-2.5-r3 - [ncurses-6.5] [gcc-15] i8krellm.c: error: passing argument 3 of gkrellm_make_decal_button from incompatible pointer type [-Wincompatible-poi
943952 - Assigned to Sam James
dev-util/pkgcruft-0.0.3-r1 fails to compile: thread main panicked at lib.rs:790:5:
944115 - Assigned to Sam James
x11-plugins/gkrellshoot-0.4.4-r5 - [ncurses-6.5] [gcc-15] gkrellshoot.c: error: passing argument 3 of gkrellm_put_decal_in_meter_button from incompatible pointer type [-W
944389 - Assigned to Sam James
net-analyzer/netcat-110.20180111-r2 fails to compile: netcat.c:304:22: error: passing argument 2 of signal from incompatible pointer type [-Wincompatible-pointer-types]
944910 - Assigned to Sam James
dev-util/clang-extract-0_pre20241002 calls cc directly
944972 - Assigned to Sam James
net-irc/anope-2.0.17 version bump
946191 - Assigned to Sam James
net-misc/socat-1.8.0.2 fails tests
946404 - Assigned to Sam James
dev-libs/crypto++-8.9.0 fails to build for arm with GCC 14
946795 - Assigned to Sam James
sys-apps/zram-generator-1.2.1 does not respect CFLAGS
946832 - Assigned to Sam James
app-emulation/qemu-guest-agent-9.2.0 has implicit function declarations in configure logs
947233 - Assigned to John Helmert III
dev-python/click-option-group-0.5.6 fails tests: FAILED test_click_option_group.py::test_missing_group_decl_first_api - assert None
947479 - Assigned to Sam James
media-sound/qpaeq needs porting to dev-python/pyqt6
948110 - Assigned to Igor V. Kovalenko
app-admin/gkrellm version bump, and fix for 9999 ebuild required
948445 - Assigned to Sam James
net-libs/rustls-ffi-0.14.0 fails test - [ffmpeg] error[E0432]: unresolved import rustls_ffi
948910 - Assigned to Sam James
app-arch/7zip echoes passwords
948946 - Assigned to NRK
sys-process/procs-0.14.9 version bump
949545 - Assigned to Sam James
sec-keys/openpgp-keys-gentoo-developers: non-deterministic because of expiry times
949595 - Assigned to Sam James
dev-libs/libkdumpfile-0.5.5-r2 fails test - [gcc-15] FAIL: xlat-os-ia32-none
949913 - Assigned to Sam James
sys-devel/mold: Fails to build rust packages with LTO - mold: fatal: failed to load plugin : /usr/bin/ld.mold: undefined symbol: onload
949982 - Assigned to Sam James
sys-libs/pam-1.6.1: "unix_chkpwd[1575]: check pass; user unknown" when using mate-extra/mate-screensaver-1.28.0 or kde-plasma/kscreenlocker-6.2.5
950022 - Assigned to immolo
dev-util/libtree-3.1.1 fails test - [texlive] [gcc-15] Make check failed. See above for details.
950039 - Assigned to Sam James
dev-util/git-delta-0.18.2-r1 fails to automatically rebuild on dev-libs/libgit2 subslot update
950124 - Assigned to Sam James
sys-auth/pambase-20250223: display lastlog previous login and put it after MotD
950228 - Assigned to Gentoo's Team for Core System packages
sys-libs/pam-1.7.0_p20241230-r3 FAILED doc/sag/Linux-PAM_SAG.pdf doc/adg/Linux-PAM_ADG.pdf
950288 - Assigned to Gentoo's Team for Core System packages
dev-libs/libkdumpfile-0.5.5-r2 - [go-1.24] [gcc-15] [ffmpeg] ld: util.o: undefined reference to symbol inflateInit2_
950583 - Assigned to Sam James
media-sound/liblc3: please port to pypy3.11
951045 - Assigned to Sam James
dev-build/meson: wrongly detects linker as bfd with llvm-core/clang and -fuse-ld=lld in *FLAGS
951712 - Assigned to Gentoo's Team for Core System packages
media-libs/openfec-1.4.2.11-r1 - [meson] [gcc-15] [cmake-4] -- Configuring incomplete, errors occurred!
951998 - Assigned to Sam James
app-forensics/volatility3: needs porting to Python 3.13+
952205 - Assigned to
dev-python/yara-python: needs porting to Python 3.13
952418 - Assigned to
media-sound/qpaeq: needs porting to Python 3.13
952555 - Assigned to Igor V. Kovalenko
media-libs/bcg729-1.1.1 - [cmake-4] -- Configuring incomplete, errors occurred!
952851 - Assigned to Sam James
net-irc/quassel must port to Qt6
953029 - Assigned to Sam James
Stabilization Bug Reports
media-gfx/graphicsmagick-1.3.43-r1, media-libs/jasper-4.2.2: stablereq
934866 - Assigned to Sam James
media-gfx/graphicsmagick-1.3.45-r1: stabilisation
940839 - Assigned to Sam James
media-gfx/img2pdf-0.5.1 and friends: stablereq
944682 - Assigned to No maintainer - Look at https://wiki.gentoo.org/wiki/Project:Proxy_Maintainers if you want to take care of it
dev-db/redis-{6.2.17,7.2.7,7.4.2}: stablereq
948175 - Assigned to Petr Vaněk
sys-devel/reflex-20241231: stablereq
950135 - Assigned to Sam James
media-sound/liblc3-1.1.1-r1: stabilisation
950193 - Assigned to Sam James
net-misc/socat-1.8.0.3: stablereq
950514 - Assigned to Sam James
sys-apps/pv-1.9.31: stablereq
951453 - Assigned to Sam James
sys-auth/pambase-20250223: stablereq
952138 - Assigned to Gentoo's Team for Core System packages
dev-libs/libxml2-2.13.7: stabilisation
952141 - Assigned to Sam James
Keywording Bug Reports
sys-devel/mold: rekeywording
914592 - Assigned to Sam James
net-misc/socat: enable static use flag
924234 - Assigned to Sam James
sys-apps/uutils-coreutils: missing ~ppc64 keyword
926708 - Assigned to Luca Barbato
net-analyzer/fail2ban: rekeywording
926965 - Assigned to Sam James
app-forensics/aflplusplus ppc64 keyword request
930151 - Assigned to Sam James
media-video/subliminal: rekeywording
936076 - Assigned to Sam James
dev-util/lcov-2.3: rekeywording
947788 - Assigned to Sebastian Pipping
app-arch/7zip: please keyword
953098 - Assigned to NRK
Description
Gentoo Bugzilla is where we track bugs of Gentoo and its packages; you are welcome to report, confirm and resolve bugs:
File a new Bug
Confirm a bug
Participate in our monthly Bugday
Shortcuts
Packages Bugs (253)
Stabilization Bugs (10)
Keywording Bugs (8)