Packages
Get Gentoo!
gentoo.org sites
gentoo.org
Wiki
Bugs
Forums
Packages
Planet
Archives
Sources
Infra Status
Home
Packages
Maintainers
USE flags
Architectures
About
Gentoo Project
Haskell
Packages
620
Stabilization
0
Outdated
198
Pull requests
1
Bugs
184
Security
1
Changelog
Bug Reports
x11-wm/xmonad-contrib-0.11.2 - XMonad.Config.Kde.kde4Config should not use krunner
497960 - Assigned to Gentoo's Haskell Language team
dev-lang/ghc-7.8.3 - no libraries/transformers/dist-install/build/Control/Monad/Trans/Identity.dyn_o
519786 - Assigned to Gentoo's Haskell Language team
dev-lang/ghc USE=binary - /usr/lib/ghc-7.6.3/settings sets wrong "C compiler command"
531016 - Assigned to Gentoo's Haskell Language team
dev-haskell/cabal-install should use TLS to download packages
537162 - Assigned to Gentoo's Haskell Language team
app-text/pandoc missing dependency/einfo?
541244 - Assigned to Gentoo's Haskell Language team
app-text/pandoc ebuild (and other haskell ebuilds) doesn't respect CC and CXX
556216 - Assigned to Gentoo's Haskell Language team
dev-haskell/connection-0.2.4: build fails when depending on >=dev-haskell/tls-1.3 due to change in API between TLS-1.2 and 1.3 (in particular contextNew function)
628330 - Assigned to Gentoo's Haskell Language team
dev-haskell/cabal-1.24.2.0: Distribution/Version.hs:144:10: Duplicate instance declarations
633540 - Assigned to Gentoo's Haskell Language team
dev-haskell/system-filepath-0.4.13.4 fails test tests.validity.posix
636148 - Assigned to Gentoo's Haskell Language team
dev-lang/ghc-7.8.4 fails configure : relocation R_X86_64_32S against symbol can not be used when making a shared object; recompile with -fPIC
639096 - Assigned to Gentoo's Haskell Language team
dev-haskell/skylighting-0.3 fails to build
646170 - Assigned to Gentoo's Haskell Language team
dev-lang/ghc-8.0.4 doesn't build under musl
651778 - Assigned to Gentoo musl team
dev-haskell/lens-4.14 : src/.../FieldTH.hs:619:28: error:
657408 - Assigned to Gentoo's Haskell Language team
dev-vcs/git-annex-6.20170818 : * environment, line 686: Called cabal-show-brokens-and-die setup configure failed
658176 - Assigned to Gentoo's Haskell Language team
dev-vcs/git-annex-6.20170818 : Not in scope: type constructor or class EnableEncryption
662680 - Assigned to Gentoo's Haskell Language team
dev-haskell/hscolour-1.24.4: cannot satisfy -package Cabal-1.24.2.0
664140 - Assigned to Gentoo's Haskell Language team
dev-lang/ghc-8.0.2[binary]: pre-compressed docs installed
667316 - Assigned to Gentoo's Haskell Language team
dev-haskell/text : not independent of ghc version
670720 - Assigned to Gentoo's Haskell Language team
dev-lang/ghc-7.10.3 with PIE (gcc-7.3) - ld: /usr/lib64/ghc-7.10.3/rts/libHSrts.a(PrimOps.o): relocation R_X86_64_32S against symbol `g0' can not be used when making a PIE object; recompile with -fPIC
674130 - Assigned to Gentoo's Haskell Language team
dev-haskell/hslua-0.3.13 - ld.gold: fatal error: cannot mix -r with dynamic object /usr/lib/gcc/x86_64-pc-linux-gnu/9.2.0/../../../../lib64/libpthread.so
695952 - Assigned to Gentoo's Haskell Language team
dev-haskell/cabal-1.24.2.0 with ghc-8.6.5: Ambiguous occurrence ‘<>’
700982 - Assigned to Gentoo's Haskell Language team
dev-haskell/zlib-0.6.2.1 : /.../ld: -r and -pie may not be used together
706542 - Assigned to Gentoo's Haskell Language team
app-portage/hackport-0.6.3 : Could not find module ‘Data.Semigroup’
707494 - Assigned to Gentoo's Haskell Language team
dev-haskell/tls-1.3.9 : Not in scope: type constructor or class Network.Socket
727620 - Assigned to Gentoo's Haskell Language team
dev-lang/ghc-8.0.2: fails to compile with lld: ld.lld: error: unknown argument '-no-relax'
732686 - Assigned to Gentoo's Haskell Language team
dev-haskell/cryptonite-0.26-r1 : * setup configure failed
735018 - Assigned to Gentoo's Haskell Language team
dev-haskell/transformers-compat-0.6.5 USE=profile - src/Control/Monad/Trans/Instances.hs:38:8: error: Could not find module ‘Prelude’ // Perhaps you haven't installed the profiling libraries for package ‘base-4.13.0.0’?
735172 - Assigned to Gentoo's Haskell Language team
dev-haskell/dns-2.0.6 : Network/.../Decode.hs: error:
735654 - Assigned to Gentoo's Haskell Language team
dev-haskell/tls-1.5.4 fails tests
735834 - Assigned to Gentoo's Haskell Language team
dev-haskell/x509-1.7.5 fails tests
735838 - Assigned to Gentoo's Haskell Language team
dev-haskell/cryptonite-0.26-r1 fails tests
735846 - Assigned to Gentoo's Haskell Language team
dev-haskell/basement-0.0.11 fails to compile: ld.lld: error: unknown argument '-no-relax'
735852 - Assigned to Gentoo's Haskell Language team
dev-haskell/cryptohash-sha256-0.11.101.0 fails to compile: ld.lld: error: unknown argument '-no-relax'
735876 - Assigned to Gentoo's Haskell Language team
dev-haskell/quickcheck-2.9.2 fails to compile
735880 - Assigned to Gentoo's Haskell Language team
dev-haskell/foundation-0.0.25 fails to compile: ld.lld: error: unknown argument '-no-relax'
735898 - Assigned to Gentoo's Haskell Language team
dev-haskell/deriving-compat-0.3.5 fails to compile
735910 - Assigned to Gentoo's Haskell Language team
dev-haskell/stringbuilder-0.5.0 : src/.../Builder.hs: error:
735934 - Assigned to Gentoo's Haskell Language team
dev-haskell/parsec1-1.0.0.6 : Text/.../Prim.hs: error:
735946 - Assigned to Gentoo's Haskell Language team
dev-haskell/x509-validation-1.6.11 fails tests: too many pending signals
736446 - Assigned to Gentoo's Haskell Language team
dev-haskell/hashable-1.2.4.0: Doesn't build with ghc > 8.0.1
736966 - Assigned to Gentoo's Haskell Language team
app-admin/haskell-updater gets stuck in rebuilds on haskell binpkgs
738802 - Assigned to Gentoo's Haskell Language team
dev-vcs/git-annex-8.20200810 : Database/Types.hs: error:
738982 - Assigned to Gentoo's Haskell Language team
app-admin/haskell-updater-1.3.2 does not respect CC
745120 - Assigned to Gentoo's Haskell Language team
dev-haskell/aeson-pretty-0.8.8 undefined reference during linking
767388 - Assigned to Gentoo's Haskell Language team
dev-haskell/zlib-0.5.4.2:0/0.5.4.2::gentoo fails to compile
767901 - Assigned to Gentoo's Haskell Language team
dev-haskell/persistent-2.10.5.2 : Database/.../Raw.hs: error:
768180 - Assigned to Gentoo's Haskell Language team
dev-haskell/quickcheck-classes-0.6.4.0 : Not in scope: data constructor Apply2
769527 - Assigned to Gentoo's Haskell Language team
dev-haskell/quickcheck-2.13.2 fails compiling due to upstream dependency changes
769893 - Assigned to Gentoo's Haskell Language team
dev-haskell/prettyprinter-1.6.1 fails to compile
773580 - Assigned to No maintainer - Look at https://wiki.gentoo.org/wiki/Project:Proxy_Maintainers if you want to take care of it
dev-lang/ghc: cross compilation of haskell packages fails
774540 - Assigned to Cross compilation support
dev-haskell/quickcheck-2.13.2 - Test/.../Random.hs: error:
782094 - Assigned to Gentoo's Haskell Language team
dev-lang/ghc-8.8.4 has unrecognized configure options: --with-compiler
784623 - Assigned to Gentoo's Haskell Language team
x11-misc/xmobar-0.37 - src/.../Parse.hs: error:
785514 - Assigned to Gentoo's Haskell Language team
dev-lang/ghc-8.10.4 fails to emerge due to error in ghc-bin-8.10.4-x86_64-pc-linux-gnu.tbz2
785637 - Assigned to Gentoo's Haskell Language team
dev-vcs/git-annex-8.20200810 - BuildFlags.hs: error:
785799 - Assigned to Gentoo's Haskell Language team
dev-haskell/hashable-1.2.7.0 - * setup configure failed
789408 - Assigned to Gentoo's Haskell Language team
dev-vcs/git-annex-8.20200810[benchmark] failed to emerge (Database/Benchmark.hs:95:26: error: Couldn't match type [Char] with B8.ByteString)
791130 - Assigned to Gentoo's Haskell Language team
dev-haskell/tree-diff-0.1 - src/.../Golden.hs: error:
796905 - Assigned to Gentoo's Haskell Language team
dev-haskell/quickcheck-classes-base-0.6.2.0 - src/.../Bitraversable.hs: error:
806314 - Assigned to Gentoo's Haskell Language team
dev-haskell/quickcheck-classes-0.6.4.0 - Not in scope: type constructor or class Eq1
806815 - Assigned to Gentoo's Haskell Language team
dev-lang/ghc-8.10.4-r1: Unable to bootstrap using musl
806965 - Assigned to Gentoo's Haskell Language team
dev-haskell/http-types-0.12.3 fails tests: - Test suite doctests: FAIL
808835 - Assigned to Gentoo's Haskell Language team
dev-haskell/xml-conduit-1.9.1.1 fails tests: - Test suite doctest: FAIL
808841 - Assigned to Gentoo's Haskell Language team
dev-haskell/prettyprinter-ansi-terminal-1.1.1.2 fails tests: - Test suite doctest: FAIL
808843 - Assigned to Gentoo's Haskell Language team
dev-haskell/hslua-1.3.0.1 fails tests: - Test suite test-hslua: FAIL
808899 - Assigned to Gentoo's Haskell Language team
dev-haskell/network-byte-order-0.1.4.0 fails tests: - Test suite doctest: FAIL
808915 - Assigned to Gentoo's Haskell Language team
dev-haskell/bsb-http-chunked-0.0.0.4 fails tests: - Test suite doctests: FAIL
808917 - Assigned to Gentoo's Haskell Language team
dev-haskell/http2-2.0.3 fails tests: - Test suite doctest: FAIL
808919 - Assigned to Gentoo's Haskell Language team
dev-haskell/yesod-form-1.6.7 - Yesod/.../Fields.hs: error:
809365 - Assigned to Gentoo's Haskell Language team
x11-misc/xmobar-0.37 - * setup configure failed
813633 - Assigned to Gentoo's Haskell Language team
dev-haskell/scientific-0.3.6.2 - * setup configure failed
813636 - Assigned to Gentoo's Haskell Language team
dev-haskell/hspec-expectations-0.8.2 - unpack: hspec-expectations-0.8.2.tar.gz does not exist
821229 - Assigned to Gentoo's Haskell Language team
app-text/pandoc-2.13 : ! LaTeX Error: File `lmodern.sty' not found.
822852 - Assigned to Gentoo's Haskell Language team
dev-haskell/hashable-1.2.7.0 - Not in scope: data constructor Natural
823962 - Assigned to Gentoo's Haskell Language team
dev-haskell/optparse-applicative-0.15.1.0 - tests/test.hs: error:
824506 - Assigned to Gentoo's Haskell Language team
dev-haskell/network-3.0.1.1 - configure: WARNING: unrecognized options: --with-compiler, --with-hc-pkg
828794 - Assigned to Gentoo's Haskell Language team
dev-haskell/old-time-1.1.0.3-r1 - configure: WARNING: unrecognized options: --with-compiler, --with-hc-pkg
828795 - Assigned to Gentoo's Haskell Language team
dev-haskell/x11-1.9.2 - configure: WARNING: unrecognized options: --with-compiler, --with-hc-pkg
828804 - Assigned to Gentoo's Haskell Language team
dev-lang/ghc-8.10.4-r1 - coreutils: cannot stat .../package.conf.d: No such file or directory
828805 - Assigned to Gentoo musl team
dev-haskell/cabal-3.2.1.0-r1 failed with llvm 13
828874 - Assigned to Gentoo's Haskell Language team
dev-lang/ghc-8.10.4-r1 - /.../ghc-pkg-8.10.4-orig:line <snip>: .../ghc-pkg: No such file or directory
828908 - Assigned to Gentoo musl team
dev-haskell/resolv-0.1.2.0 - configure: WARNING: unrecognized options: --with-compiler, --with-hc-pkg
828977 - Assigned to Gentoo's Haskell Language team
dev-haskell/x509-validation-1.6.11 fails tests: - Test suite test-x509-validation: FAIL
830733 - Assigned to Gentoo's Haskell Language team
dev-haskell/cereal-vector-0.2.0.1 - test/test.hs: error:
833343 - Assigned to Gentoo's Haskell Language team
dev-haskell/hackage-security: linking failure
839636 - Assigned to Gentoo's Haskell Language team
dev-haskell/git-lfs-1.1.0 - Network/GitLFS.hs: error:
840553 - Assigned to Gentoo's Haskell Language team
dev-haskell/th-lift-instances-0.1.14 - tests/Main.hs: error:
840619 - Assigned to Gentoo's Haskell Language team
dev-haskell/cabal-3.2.1.0-r1 fails to build (configure phase)
852644 - Assigned to Gentoo's Haskell Language team
dev-lang/ghc-9.0.2-r2 - QA Notice: Unrecognized configure options:
860207 - Assigned to Gentoo's Haskell Language team
dev-lang/ghc-9.2.8 installs files that contain writable and executable sections
860225 - Assigned to Gentoo's Haskell Language team
x11-wm/xmonad-0.15-r1 fails to compile: Parse error in pattern: prop_point_within
860390 - Assigned to Gentoo's Haskell Language team
dev-haskell/persistent-2.14.0.3 - Database/.../Base.hs: error:
861407 - Assigned to Gentoo's Haskell Language team
x11-misc/xmobar-0.44.1 fails tests
862435 - Assigned to Gentoo's Haskell Language team
dev-haskell/warp-tls-3.2.12 - Not in scope: tlsClientCertificate
863191 - Assigned to Gentoo's Haskell Language team
dev-haskell/haddock-library-1.10.0: Could not deduce (Parsec.Stream Text Data.Functor.Identity.Identity Char)
863497 - Assigned to Gentoo's Haskell Language team
dev-haskell/regex-tdfa-1.3.2 fails tests: Could not import module: Text.Regex.TDFA.
864729 - Assigned to Gentoo's Haskell Language team
dev-haskell/persistent-sqlite-2.13.1.0 - Database/.../Sqlite.hs: error:
865035 - Assigned to Gentoo's Haskell Language team
app-portage/hackport-0.7.2.2 : Could not find module ‘Distribution.Extra.Doctest’
865135 - Assigned to Gentoo's Haskell Language team
x11-misc/xmobar-0.44.1 - src/.../UVMeter.hs: error:
865795 - Assigned to Gentoo's Haskell Language team
dev-lang/ghc-9.0.2-r4 - checking whether CC supports --target... x86_64-pc-linux-gnu-gcc: error: unrecognized command-line option --t
872356 - Assigned to Gentoo's Haskell Language team
dev-haskell/wai-extra-3.1.4.1 - file collision with dev-libs/openpace-1.1.2
876847 - Assigned to Gentoo's Haskell Language team
dev-lang/ghc-9.0.2 - ln: failed to create symbolic link .../haddock: No such file or directory
879531 - Assigned to Gentoo's Haskell Language team
dev-haskell/cabal-3.4.1.0 - Distribution/.../Structured.hs: error:
880023 - Assigned to Gentoo's Haskell Language team
dev-lang/ghc-9.0.2 - /.../install: cannot create regular file .../ghc-9.0.2: No such file or directory
880067 - Assigned to Gentoo's Haskell Language team
dev-haskell/hsyaml-0.2.1.0 - src/.../Internal.hs: error:
880167 - Assigned to Gentoo's Haskell Language team
dev-haskell/microstache-1.0.2 - src/.../Parser.hs: error:
880597 - Assigned to Gentoo's Haskell Language team
dev-haskell/haddock-library-1.10.0 - src/.../Monad.hs: error:
881469 - Assigned to Gentoo's Haskell Language team
dev-haskell/jira-wiki-markup-1.4.0 - src/.../Core.hs: error:
881667 - Assigned to Gentoo's Haskell Language team
dev-lang/ghc-9.0.2 - warning: a function declaration without a prototype is deprecated in all versions of C [-Wstrict-prototypes]
881829 - Assigned to Gentoo's Haskell Language team
dev-lang/ghc-9.0.2 - cp: cannot create regular file .../CCS.hs-boot: No such file or directory
882025 - Assigned to Gentoo's Haskell Language team
dev-lang/ghc: configure breakage with Clang 16
882545 - Assigned to Gentoo's Haskell Language team
dev-haskell/cabal-install-3.4.1.0-r2 - setup: Failed parsing ./cabal-install.cabal.
882931 - Assigned to Gentoo's Haskell Language team
dev-haskell/ghc-paths-0.1.0.12-r1 - setup: Failed parsing ./ghc-paths.cabal.
883047 - Assigned to Gentoo's Haskell Language team
dev-haskell/dbus-1.2.27 - setup: Failed parsing ./dbus.cabal.
883297 - Assigned to Gentoo's Haskell Language team
dev-lang/ghc-9.0.2-r2[binary] fails to install: Failed to backup initial package.conf.d: No such file or directory
884521 - Assigned to Gentoo's Haskell Language team
dev-haskell/alsa-mixer-0.3.0 - /.../floatn-common.h:214: (column 23) [ERROR] >>> Syntax error !
885639 - Assigned to Gentoo's Haskell Language team
dev-lang/ghc-8.10.6-r1 - rts/.../Signals.c: error:
887241 - Assigned to Gentoo's Haskell Language team
dev-lang/ghc-9.0.2-r2 - inlined from writeCCSReportJson at rts/ProfilerReportJson.c: error:
889226 - Assigned to Gentoo's Haskell Language team
dev-lang/ghc-9.0.2-r3 fails to compile (MUSL-SYSTEM): mv: cannot stat lib lib64: No such file or directory
890792 - Assigned to Gentoo's Haskell Language team
dev-util/shellcheck-0.9.0 - src/.../Fixer.hs: error:
894636 - Assigned to Gentoo's Haskell Language team
dev-lang/ghc-9.0.2-r3 - patch -p1 failed with /var/tmp/portage/dev-lang/ghc-9.0.2-r3/files/ghc-9.0.2-sphinx-6.patch
894786 - Assigned to Gentoo's Haskell Language team
dev-lang/ghc-9.0.2-r4 - ERROR: dev-lang/ghc-9.0.2-r4::gentoo failed (setup phase):
895764 - Assigned to Gentoo musl team
dev-haskell/xml-conduit-1.9.1.1 - compiling .../Setup.hs failed
895766 - Assigned to Gentoo's Haskell Language team
dev-haskell/cabal-3.4.1.0 - Distribution/Fields/Lexer.hs:62:1: error: Could not load module `Data.Array'
900366 - Assigned to Gentoo's Haskell Language team
app-portage/hackport-0.7.2.2 - compiling .../Setup.hs failed
902115 - Assigned to Gentoo's Haskell Language team
dev-haskell/foldl: unknown package: process-1.6.13.2
905260 - Assigned to Gentoo's Haskell Language team
dev-lang/ghc-9.0.2-r4 - rts/.../Evac.c: error:
905404 - Assigned to Gentoo's Haskell Language team
dev-lang/ghc-9.0.2-r4 - rts/Libdw.c: error:
907986 - Assigned to Gentoo's Haskell Language team
app-text/pandoc-2.18-r2: missing dependency on dev-libs/icu
910567 - Assigned to Gentoo's Haskell Language team
dev-lang/ghc-9.0.2-r4 - make: [Makefile:<snip>: .../ghc-stage2] Error 2
911869 - Assigned to Gentoo's Haskell Language team
dev-lang/ghc-9.0.2-r4 - inlined from LdvCensusForDead at rts/LdvProfile.c: error:
913168 - Assigned to Gentoo's Haskell Language team
x11-misc/xmobar-0.46 - error: CairoSurface.hsc: fatal error: cairo/cairo-xlib.h: No such file or directory
916184 - Assigned to Gentoo's Haskell Language team
dev-haskell/glib-0.13.10.0 - System/.../Signals.chs: error:
916473 - Assigned to Gentoo's Haskell Language team
dev-haskell/prettyprinter-ansi-terminal-1.1.3 - src/.../Internal.hs: error:
916743 - Assigned to Gentoo's Haskell Language team
dev-lang/ghc-9.2.8 - emake failed
917330 - Assigned to Gentoo's Haskell Language team
dev-lang/ghc-9.0.2-r4 - Error 2 shuffle=3696850168 + gmp warning
917331 - Assigned to Gentoo's Haskell Language team
dev-lang/ghc-9.2.8 - /.../install: cannot create regular file .../ghc-9.2.8: No such file or directory
917391 - Assigned to Gentoo's Haskell Language team
dev-haskell/cabal-install-3.4.1.0-r3 - ERROR: dev-haskell/cabal-install-3.4.1.0-r3::gentoo failed (prepare phase):
917595 - Assigned to Gentoo's Haskell Language team
dev-lang/ghc-9.2.8 - ghc/stage1/package-data.mk: No such file or director
917641 - Assigned to Gentoo's Haskell Language team
dev-haskell/monads-tf-0.3.0.1 - setup configure failed
917687 - Assigned to Gentoo's Haskell Language team
dev-lang/ghc-9.2.8 - /.../ld: .../Main.o: relocation R_X86_64_32S against symbol stg_bh_upd_frame_info can not be used when making a PIE object; recom
918484 - Assigned to Gentoo's Haskell Language team
dev-haskell/persistent-sqlite-2.13.1.1 - <command line>: .../libHSbitvec-1.1.3.0-5G2b6x3gagmB5Myy1Q8zeB-ghc9.2.8.so: undefined symbol: _gmpn_popcount
920529 - Assigned to Gentoo's Haskell Language team
dev-lang/ghc-9.8.4-r1 missing bash completion symlink
920834 - Assigned to Gentoo's Haskell Language team
dev-lang/ghc-9.2.8 implicit function declaration in configure logs: exit
920835 - Assigned to Gentoo's Haskell Language team
dev-lang/ghc-9.2.8 StgCRunAsm.o contain writable and executable sections
920836 - Assigned to Gentoo's Haskell Language team
dev-lang/ghc-9.2.8 fails to prepare source on PaX enabled systems USE=-ghcbootstrap
920838 - Assigned to Gentoo's Haskell Language team
dev-haskell/chell-0.5.0.2 - [clang] setup configure failed
921574 - Assigned to Gentoo's Haskell Language team
dev-lang/ghc-9.2.8 fails to compile: ghc: could not execute: opt
923100 - Assigned to Gentoo's Haskell Language team
app-portage/hackport-0.8.4.0 installs files that contain insecure RUNPATHs
924159 - Assigned to Gentoo's Haskell Language team
app-admin/haskell-updater-1.3.2-r1 fails to compile: ghc: out of memory (requested 1048576 bytes)
924173 - Assigned to Gentoo's Haskell Language team
dev-haskell/crypton-x509-validation-1.6.12 fails test - valid: Test suite test-x509-validation: FAIL
927706 - Assigned to Gentoo's Haskell Language team
dev-lang/ghc-9.2.8 - ERROR: dev-lang/ghc-9.2.8::gentoo failed (setup phase):
928874 - Assigned to Gentoo musl team
dev-lang/ghc-9.2.8 - [slibtool] [clang] ld: error: relocation R_X86_64_32S cannot be used against symbol ghcizm9zi2zi8_GHCiziMessage_QFail_con_info; recompile with -fPIC
929075 - Assigned to Gentoo's Haskell Language team
app-portage/hackport-0.8.4.0 - setup build failed
938723 - Assigned to Gentoo's Haskell Language team
dev-lang/ghc breakage on arm/arm64 without LLVM 14
943037 - Assigned to LLVM support project
dev-lang/ghc: update to llvm-r2 or remove llvm.eclass
945343 - Assigned to Gentoo's Haskell Language team
dev-haskell/crypton-0.32 fails tests
951946 - Assigned to Gentoo's Haskell Language team
dev-lang/ghc: needs porting to Python 3.13+
952295 - Assigned to Gentoo's Haskell Language team
dev-haskell/cabal-install-3.14.1::haskell fails with "Couldn't match expected type" error
954225 - Assigned to Gentoo's Haskell Language team
dev-lang/ghc-9.2.8: fails to build with sys-devel/gcc-16 because of -Werror
961741 - Assigned to Gentoo's Haskell Language team
dev-lang/ghc-9.2.8 - [gcc-16] [jdk26] make[1]: [libraries/.../ghc.mk:4: libraries/.../CCS.hs-boot] Error 1
965317 - Assigned to Gentoo's Haskell Language team
dev-lang/ghc-9.2.8 - QA Notice: The following files contain writable and executable sections
967864 - Assigned to Gentoo's Haskell Language team
dev-haskell/process-1.6.26 causing build failures for dependent packages, specifically cabal-install
968251 - Assigned to Gentoo's Haskell Language team
dev-haskell/vector-0.13.2.0 - failed to build with USE=doc - setup: internal error when calculating transitive package dependencies
968809 - Assigned to Gentoo's Haskell Language team
dev-haskell/aeson-2.1.2.1 fails to configure: installed package attoparsec-0.14.4 is broken due to missing package scientific-0.3.7.0-7FCQZlRjKCq4ts9Id77805
968831 - Assigned to Gentoo's Haskell Language team
dev-haskell/vector: conflicting dependencies
968896 - Assigned to Gentoo's Haskell Language team
dev-haskell/wai-app-static-3.1.7.2-r1 - file collision with net-misc/warp-0.9.2:0::guru
973088 - Assigned to Gentoo Linux bug wranglers
dev-lang/ghc-9.8.4-r1 - QA Notice: The ebuild is installing to one or more unexpected directories:
977984 - Assigned to Gentoo's Haskell Language team
dev-util/shake-0.19.8 - QA Notice: The following files contain insecure RUNPATHs
977986 - Assigned to Gentoo's Haskell Language team
dev-lang/ghc-9.8.4-r1 fails 9 tests: T11649 T22187 T25019 T5681 T7571 T8131b hs_try_putmvar001 list_threads_and_misc_roots testwsdeque
978012 - Assigned to Gentoo's Haskell Language team
dev-lang/ghc-9.8.4-r1 with clang fails in src_install: configure: error: Failed to find C++ standard library
978027 - Assigned to Gentoo's Haskell Language team
dev-lang/ghc-9.8.4-r1 requires LLVM_SLOT even without llvm USE flag
978063 - Assigned to Gentoo's Haskell Language team
app-portage/hackport has a missing dependency: dev-haskell/data-default-class
978066 - Assigned to Gentoo's Haskell Language team
dev-lang/ghc-9.8.4-r1 - [boost-1.91] QA Notice: Problems with installed bash completions were found:
978309 - Assigned to Gentoo's Haskell Language team
dev-haskell/hscolour-1.25 - [meson] [perl-5.44] QA Notice: The following files contain insecure RUNPATHs
978420 - Assigned to Gentoo's Haskell Language team
dev-haskell/hslua-2.5.0 - file collision with dev-haskell/hslua-cli-1.4.2
978726 - Assigned to Gentoo's Haskell Language team
sec-keys/openpgp-keys-ghc-20250925-r1 fails test - [eigen-5.0] [perl-5.44] [portage-9999] ERROR: sec-keys/openpgp-keys-ghc-20250925-r1::gentoo failed (test phase):
979043 - Assigned to Gentoo's Haskell Language team
dev-lang/ghc-9.8.4-r1[ghcbootstrap]: No bootstrap path from 9.2.8
979805 - Assigned to Gentoo's Haskell Language team
dev-haskell/doctest-0.22.10 fails tests: cabal: readCreateProcess: posix_spawnp: does not exist (No such file or directory)
980347 - Assigned to Gentoo's Haskell Language team
dev-haskell/bitvec-1.1.5.0: Error: setup: Encountered missing or private dependencies: primitive >=0.5 && <0.9, tasty <1.5, tasty-quickcheck <0.11
980348 - Assigned to Gentoo's Haskell Language team
dev-haskell/doctest-driver-gen-0.3.0.7: Error: setup: Encountered missing or private dependencies: base >=4.0 && <4.19
980349 - Assigned to Gentoo's Haskell Language team
dev-lang/ghc-9.8.4-r1 - [eigen-5.0] QA Notice: econf called in src_compile instead of src_configure
983577 - Assigned to Gentoo's Haskell Language team
Stabilization Bug Reports
app-text/pandoc stable request
737612 - Assigned to Gentoo's Haskell Language team
Keywording Bug Reports
dev-util/shellcheck-0.9.0: keyword request
914182 - Assigned to Gentoo's Haskell Language team
Description
Gentoo Bugzilla is where we track bugs of Gentoo and its packages; you are welcome to report, confirm and resolve bugs:
File a new Bug
Confirm a bug
Participate in our monthly Bugday
Shortcuts
Packages Bugs (182)
Stabilization Bugs (1)
Keywording Bugs (1)